program: Orca
programVersion: 5.0.2
elementType: O O O C C C C C C C C C C C C C C C C C C C C C C C H H H H H H H H H H H H H H H H H H H H H H H H H H
charge: 0
multiplicity: 1
keywords: wb97x-d3
keywords: def2-TZVPP
keywords: def2/J RIJCOSX
keywords: DEFGRID2
keywords: scfconv7
keywords: smallprint printgap noloewdin
keywords: NOSOSCF
formula: C23H26O3
InChI: InChI=1/C23H26O3/c1-16(2)13-20-21(23(20,3)4)22(24)25-15-17-9-8-12-19(14-17)26-18-10-6-5-7-11-18/h5-14,20-21H,15H2,1-4H3
52 atoms
O  0.74568 -2.627971 -1.049608
O  0.303815 -2.308627 1.120226
O  2.676688 1.987258 -0.669424
C  -2.674313 -2.031223 0.185579
C  -2.049443 -0.673852 0.190223
C  -1.357428 -1.80857 -0.535232
C  -3.858824 -2.287391 -0.715282
C  -2.726694 -2.816783 1.473058
C  -2.546482 0.484482 -0.593924
C  -0.05185 -2.27386 -0.026587
C  -3.657015 1.175378 -0.338709
C  -4.029611 2.372383 -1.159244
C  -4.593528 0.852694 0.784996
C  2.102126 -2.895407 -0.746312
C  2.887262 -1.651711 -0.417909
C  2.404737 -0.388651 -0.721491
C  4.13744 -1.776912 0.179412
C  3.148024 0.736059 -0.38955
C  4.8889 -0.651196 0.46962
C  4.394649 0.616813 0.199685
C  1.463066 2.367471 -0.175332
C  0.914656 1.831492 0.984936
C  0.79627 3.371536 -0.866373
C  -0.299963 2.316412 1.446675
C  -0.414058 3.847559 -0.387776
C  -0.970457 3.322228 0.768763
H  -1.561869 -0.411833 1.126922
H  -1.4312 -1.790392 -1.617238
H  -3.922761 -3.346826 -0.969666
H  -3.808232 -1.718927 -1.642876
H  -4.788375 -2.010885 -0.21397
H  -3.658637 -2.594671 1.998102
H  -1.901691 -2.589004 2.142543
H  -2.7123 -3.890252 1.27577
H  -1.909051 0.820711 -1.406727
H  -5.016586 2.250873 -1.612766
H  -3.310653 2.560006 -1.955447
H  -4.081969 3.270814 -0.538142
H  -5.602213 0.657595 0.41189
H  -4.677033 1.702429 1.468166
H  -4.276982 -0.010824 1.367135
H  2.50271 -3.364214 -1.646599
H  2.187597 -3.615388 0.071394
H  1.444479 -0.25879 -1.204065
H  4.522342 -2.758804 0.426997
H  5.860895 -0.757498 0.932733
H  4.961965 1.504172 0.446627
H  1.422592 1.046165 1.529589
H  1.23553 3.777784 -1.76824
H  -0.722365 1.898787 2.351522
H  -0.926886 4.631825 -0.929393
H  -1.919253 3.68904 1.135918
totalener: -1117.84497746 hartree
nucrepener: 2371.79172079 hartree
electener: -3489.63669826 hartree
oneelecener: -6232.39379332 hartree
twoeener: 2742.75709506 hartree
kineticenergy: 1112.86313280 hartree
xcener: -110.237858518627 hartree
chargesum: -0.0000000
charge: -0.279979 -0.373942 -0.301700 0.081137 -0.073781 -0.027612 -0.251055 -0.259673 -0.164264 0.283689 -0.010239 -0.223341 -0.255223 0.054075 0.074719 -0.193883 -0.196606 0.218950 -0.091716 -0.195230 0.260946 -0.158877 -0.206801 -0.142892 -0.101157 -0.135209 0.099569 0.086426 0.098094 0.085272 0.082719 0.077925 0.103733 0.088274 0.086005 0.097791 0.083416 0.076920 0.093737 0.093329 0.086710 0.112944 0.106335 0.128428 0.106820 0.124503 0.124919 0.136251 0.122315 0.131338 0.121554 0.114338
qa: -0.2800 -0.3739 -0.3017 0.0811 -0.0738 -0.0276 -0.2511 -0.2597 -0.1643 0.2837 -0.0102 -0.2233 -0.2552 0.0541 0.0747 -0.1939 -0.1966 0.2189 -0.0917 -0.1952 0.2609 -0.1589 -0.2068 -0.1429 -0.1012 -0.1352 0.0996 0.0864 0.0981 0.0853 0.0827 0.0779 0.1037 0.0883 0.0860 0.0978 0.0834 0.0769 0.0937 0.0933 0.0867 0.1129 0.1063 0.1284 0.1068 0.1245 0.1249 0.1363 0.1223 0.1313 0.1216 0.1143
va: 2.1141 2.1175 2.1085 3.8133 3.8070 3.7979 3.9035 3.8996 3.8076 4.2391 3.7029 3.9329 3.9339 3.8674 3.6564 3.9902 4.0331 3.8419 3.9350 4.0484 3.7851 3.8649 4.0209 3.9058 3.9196 3.9084 1.0286 1.0326 1.0065 1.0080 1.0028 1.0031 1.0235 1.0035 1.0168 1.0028 1.0105 0.9985 0.9982 1.0046 1.0077 0.9864 1.0096 1.0164 1.0095 0.9994 1.0112 1.0089 1.0146 0.9976 0.9998 0.9999
dispcorr: -0.030358135 hartree
energy: -1117.875335600279
dipole: -30.19980 29.67535 -0.52445 -1.27133 1.11236 -0.15896 2.01071 -2.28710 -0.27639
magnitude: 0.61376 au
magnitude: 1.56006 debye
