program: Orca
programVersion: 5.0.2
elementType: O O O C C C C C C C C C C C C C C C C C C C C C C C H H H H H H H H H H H H H H H H H H H H H H H H H H
charge: 0
multiplicity: 1
keywords: wb97x-d3
keywords: def2-TZVPP
keywords: def2/J RIJCOSX
keywords: DEFGRID2
keywords: scfconv7
keywords: smallprint printgap noloewdin
keywords: NOSOSCF
formula: C23H26O3
InChI: InChI=1/C23H26O3/c1-16(2)13-20-21(23(20,3)4)22(24)25-15-17-9-8-12-19(14-17)26-18-10-6-5-7-11-18/h5-14,20-21H,15H2,1-4H3
52 atoms
O  0.356208 -2.038158 -1.318235
O  0.001451 -3.144655 0.593961
O  2.062803 2.182234 0.962349
C  -3.022003 -2.898242 -0.259228
C  -2.685219 -1.840755 0.734345
C  -1.809434 -2.013369 -0.492587
C  -4.173894 -2.662123 -1.207346
C  -2.856785 -4.346672 0.129423
C  -3.509524 -0.61626 0.897868
C  -0.420452 -2.481479 -0.314952
C  -3.032427 0.611833 1.105613
C  -3.948542 1.787041 1.265804
C  -1.571469 0.929222 1.189375
C  1.754235 -2.242357 -1.182489
C  2.373737 -1.28621 -0.197788
C  1.915268 0.023941 -0.113307
C  3.424423 -1.70077 0.609218
C  2.510404 0.907675 0.776887
C  4.017435 -0.807958 1.488609
C  3.568291 0.498357 1.577015
C  1.578797 2.925442 -0.070994
C  0.529072 3.787024 0.218549
C  2.128015 2.893451 -1.34732
C  0.024323 4.61279 -0.772845
C  1.606368 3.718782 -2.331995
C  0.554534 4.57922 -2.054141
H  -2.223761 -2.216516 1.644816
H  -1.931613 -1.267872 -1.270079
H  -4.045064 -3.247267 -2.119341
H  -4.268636 -1.615143 -1.495392
H  -5.117928 -2.966815 -0.750499
H  -3.78136 -4.71019 0.582203
H  -2.052702 -4.502566 0.843966
H  -2.654827 -4.96679 -0.746044
H  -4.587252 -0.751419 0.866675
H  -3.811414 2.263079 2.239776
H  -4.997197 1.506346 1.174808
H  -3.737405 2.551349 0.513312
H  -1.349286 1.475578 2.109273
H  -1.26975 1.581789 0.365595
H  -0.934514 0.048052 1.173144
H  2.158283 -2.071088 -2.181845
H  1.978395 -3.273971 -0.903136
H  1.086589 0.350266 -0.729327
H  3.769486 -2.725921 0.563626
H  4.833057 -1.134555 2.11987
H  4.018741 1.198343 2.268016
H  0.119108 3.806353 1.219797
H  2.956809 2.235446 -1.573572
H  -0.792621 5.283091 -0.539954
H  2.03546 3.69074 -3.324983
H  0.155155 5.22088 -2.82762
totalener: -1117.84607544 hartree
nucrepener: 2317.84357711 hartree
electener: -3435.68965255 hartree
oneelecener: -6124.38579970 hartree
twoeener: 2688.69614715 hartree
kineticenergy: 1112.85643220 hartree
xcener: -110.234717666578 hartree
chargesum: -0.0000000
charge: -0.274828 -0.374726 -0.303636 0.133608 -0.012483 -0.103479 -0.272503 -0.259279 -0.246850 0.304927 0.025130 -0.218083 -0.254696 0.068159 0.076851 -0.307060 -0.183067 0.325485 -0.071940 -0.242963 0.294774 -0.272577 -0.184937 -0.070750 -0.106323 -0.153868 0.107794 0.086646 0.090666 0.085822 0.089901 0.082251 0.101807 0.083939 0.092596 0.086572 0.079366 0.083924 0.092197 0.090554 0.092504 0.103871 0.100953 0.138653 0.105033 0.123826 0.124163 0.132832 0.131473 0.125808 0.126749 0.125213
qa: -0.2748 -0.3747 -0.3036 0.1336 -0.0125 -0.1035 -0.2725 -0.2593 -0.2468 0.3049 0.0251 -0.2181 -0.2547 0.0682 0.0769 -0.3071 -0.1831 0.3255 -0.0719 -0.2430 0.2948 -0.2726 -0.1849 -0.0707 -0.1063 -0.1539 0.1078 0.0866 0.0907 0.0858 0.0899 0.0823 0.1018 0.0839 0.0926 0.0866 0.0794 0.0839 0.0922 0.0906 0.0925 0.1039 0.1010 0.1387 0.1050 0.1238 0.1242 0.1328 0.1315 0.1258 0.1267 0.1252
va: 2.1062 2.1225 2.0942 3.7379 3.8098 3.8097 3.9091 3.9024 3.9121 4.2261 3.7140 3.9402 3.9483 3.8701 3.7016 3.9527 4.0449 3.6931 3.9309 4.0819 3.7423 4.0037 3.9523 3.9105 3.9416 3.9786 1.0244 1.0312 1.0064 1.0050 1.0017 1.0019 1.0217 1.0022 1.0093 0.9992 1.0103 0.9992 1.0033 0.9978 1.0138 0.9866 1.0132 1.0115 1.0119 0.9992 1.0139 1.0095 1.0054 0.9984 0.9994 1.0006
dispcorr: -0.027392723 hartree
energy: -1117.873468163691
dipole: -23.00429 22.84427 -0.16002 -4.04289 4.43801 0.39511 -0.64131 -0.03850 -0.67980
magnitude: 0.80241 au
magnitude: 2.03955 debye
