program: Orca
programVersion: 5.0.3
elementType: Cl Cl O O O C C C C C C C C C C C C C C C C C C C C C H H H H H H H H H H H H H H H H H H H H
charge: 0
multiplicity: 1
keywords: wb97x-d3
keywords: def2-TZVPP
keywords: def2/J RIJCOSX
keywords: DEFGRID2
keywords: scfconv7
keywords: smallprint printgap noloewdin
keywords: NOSOSCF
formula: C21H20Cl2O3
InChI: InChI=1/C21H20Cl2O3/c1-21(2)17(12-18(22)23)19(21)20(24)25-13-14-7-6-10-16(11-14)26-15-8-4-3-5-9-15/h3-12,17,19H,13H2,1-2H3
46 atoms
Cl 2.613821 -5.11732 0.884614
Cl 4.36778 -5.367365 -1.391814
O  -1.305417 -0.898434 -2.103023
O  -1.23986 -1.964252 -0.138307
O  -1.010787 3.256014 0.585115
C  1.775583 -0.945364 -0.493242
C  1.665842 -2.447187 -0.493951
C  0.772443 -1.631879 -1.398695
C  2.938713 -0.271438 -1.178629
C  1.322455 -0.214975 0.747367
C  2.697904 -3.294316 -1.103088
C  -0.67526 -1.545257 -1.121293
C  3.158819 -4.431016 -0.597202
C  -2.676531 -0.554448 -1.890522
C  -2.837172 0.446771 -0.779757
C  -1.900034 1.458963 -0.609481
C  -3.930314 0.375255 0.075082
C  -2.037789 2.364936 0.43167
C  -4.072272 1.305172 1.095657
C  -3.125199 2.299058 1.294595
C  -1.218983 4.513599 1.089856
C  -0.236995 5.01549 1.932683
C  -2.311529 5.292889 0.729731
C  -0.347423 6.311468 2.41505
C  -2.414988 6.582989 1.231096
C  -1.438043 7.098854 2.072459
H  1.176022 -2.859892 0.380644
H  1.029561 -1.611666 -2.452091
H  3.818245 -0.27581 -0.532516
H  3.21118 -0.742073 -2.12223
H  2.691478 0.769264 -1.394017
H  2.163489 -0.112783 1.435306
H  0.975011 0.790729 0.502462
H  0.525696 -0.725658 1.284412
H  3.120456 -2.976836 -2.048832
H  -3.001817 -0.132696 -2.841335
H  -3.277005 -1.446387 -1.701816
H  -1.042127 1.542466 -1.266173
H  -4.662535 -0.413131 -0.046224
H  -4.920001 1.242623 1.765083
H  -3.235179 2.99464 2.116242
H  0.611193 4.397713 2.199225
H  -3.073591 4.909402 0.063208
H  0.423258 6.702374 3.066343
H  -3.265969 7.190422 0.952208
H  -1.524192 8.107218 2.454339
elementType: Cl O C H
totalener: -1958.43585603 hartree
nucrepener: 2461.79569537 hartree
electener: -4420.23155140 hartree
oneelecener: -7577.66470041 hartree
twoeener: 3157.43314901 hartree
cpcmener: -0.03172902 hartree
kineticenergy: 1952.55353639 hartree
xcener: -143.507487517222 hartree
chargesum: 0.0000000
charge: -0.058631 -0.063137 -0.289688 -0.474560 -0.337735 0.096607 0.025098 -0.067347 -0.268428 -0.269444 -0.201676 0.385221 0.036733 0.103194 0.064944 -0.346603 -0.233502 0.346825 -0.120132 -0.235942 0.296850 -0.256388 -0.206239 -0.126806 -0.149573 -0.186934 0.075803 0.102156 0.101668 0.093229 0.098818 0.107435 0.089592 0.095051 0.132728 0.123968 0.119049 0.137504 0.144613 0.162176 0.159143 0.149442 0.159262 0.161721 0.162503 0.161431
qa: -0.0586 -0.0631 -0.2897 -0.4746 -0.3377 0.0966 0.0251 -0.0673 -0.2684 -0.2694 -0.2017 0.3852 0.0367 0.1032 0.0649 -0.3466 -0.2335 0.3468 -0.1201 -0.2359 0.2969 -0.2564 -0.2062 -0.1268 -0.1496 -0.1869 0.0758 0.1022 0.1017 0.0932 0.0988 0.1074 0.0896 0.0951 0.1327 0.1240 0.1190 0.1375 0.1446 0.1622 0.1591 0.1494 0.1593 0.1617 0.1625 0.1614
va: 1.2671 1.2417 2.1136 2.0256 2.0468 3.7294 3.8938 3.8067 3.9027 3.8958 3.8949 4.2116 4.2057 3.7815 3.5813 4.0267 3.9831 3.6415 3.8905 3.9540 3.6759 3.9979 3.9181 3.8804 3.8908 3.8963 1.0508 1.0317 1.0009 1.0050 1.0016 1.0020 1.0069 1.0161 1.0171 0.9934 1.0075 1.0264 1.0026 0.9886 0.9957 1.0060 0.9968 0.9884 0.9891 0.9893
dispcorr: -0.023150006 hartree
energy: -1958.459006033176
dipole: -17.31184 16.80771 -0.50413 39.93495 -38.04049 1.89446 2.40863 -3.30062 -0.89199
magnitude: 2.15379 au
magnitude: 5.47449 debye
