program: Gaussian 09
title: 000067660
version: EM64L-G09RevD.01
frameworkgroup: C1[X(C6H3ClFNO2)]
method: RPBEPBE
basis: SDD
operation: Freq
keyword: #p
keyword: freq=noraman
keyword: PBEPBE/SDD
title: #p freq=noraman PBEPBE/SDD
converged: NO NO NO NO
title: Mulliken charges:
elementType: Cl F O O N C C C C C C H H H
charge: -0.012521 -0.145629 -0.199364 -0.168449 0.027483 0.259128 -0.277086 0.236411 -0.102827 -0.302440 -0.180301 0.318044 0.275485 0.272068
chargesum: 0.00000
title: Mulliken charges with hydrogens summed into heavy atoms:
elementType: Cl F O O N C C C C C C
charge: -0.012521 -0.145629 -0.199364 -0.168449 0.027483 0.259128 0.040959 0.236411 -0.102827 -0.026955 0.091767
polarizability: 1.30991068e+02 -1.90899797e+00 1.03373463e+02 -1.42607088e-03 -2.89594814e-03 3.29882511e+01
1716.lowfreq: 0.0026 0.0027 0.0033 1.3828 4.9185 11.9689 36.4877 108.4882 151.2010
frequency: 34.4284 108.4830 151.2003 169.4351 265.2009 324.7527 347.1334 369.2701 374.6923 430.0333 524.0361 532.9167 628.6755 658.9803 670.5634 719.5720 756.8627 824.7155 848.3968 917.7105 954.9635 1057.4903 1084.3567 1143.7589 1192.7328 1210.2914 1243.6665 1353.0340 1377.4747 1405.2552 1465.4642 1580.9897 1601.8467 3169.1785 3181.8455 3187.1860
redmass: 15.8542 9.0611 6.3840 16.5795 13.3407 7.7223 18.3503 9.7216 11.2401 3.7037 4.0007 6.5114 8.3378 5.2693 10.0358 6.3458 8.7258 1.4146 8.2475 1.3925 1.3374 2.5873 2.8967 1.4933 9.3604 3.8014 1.4121 5.2068 9.0106 5.9644 2.8979 8.9693 7.4514 1.0893 1.0925 1.0981
irintensity: 0.0163 1.0913 0.9868 1.3993 1.0067 1.0771 1.3941 0.1059 1.0624 0.7170 19.7249 2.2785 20.7829 0.0019 45.5587 4.0897 14.0212 51.8266 5.4797 18.2992 2.8060 24.2335 50.4733 8.2625 248.1511 32.8019 15.9575 32.3261 48.6041 14.3355 201.8069 19.2403 2.6442 0.3058 11.9335 0.8672
temp: 298.150 k
press: 1.00000 atm
elementType: 17 9 8 8 7 6 6 6 6 6 6 1 1 1
symmnumber: 1
zpe: 214529.9 jmol-1
zpe.correction: 0.081710 hartree
zpe.thermalcorrener: 0.090955 hartree
zpe.thermalcorrenthalpy: 0.091899 hartree
zpe.thermalcorrgfe: 0.045720 hartree
zpe.sumelectzpe: -994.654047 hartree
zpe.sumelectthermal: -994.644803 hartree
zpe.sumelectthermalent: -994.643858 hartree
zpe.sumelectthermalfe: -994.690037 hartree
dipole: 3.8154 3.0762 -0.0043
dipole: 4.9011
quadrupole: -81.4749 -66.7197 -68.4082
quadrupole: 0.2678 0.0127 0.0145
quadrupole: -9.2740 5.4812 3.7927 0.2678 0.0127 0.0145
hfenergy: -994.7357573 hartree
pointgroup: C01 [X(C6H3Cl1F1N1O2)]
dipole: 1.6892995 0.9296933 -0.0016896 debye
dipolederiv: -0.5773108 0.2705526 -0.0000368 0.3348899 -0.2713108 0.0000062 -0.0000996 0.0001083 -0.0379846 -0.5814377 0.4168952 -0.0002013 0.3600902 -0.5493671 0.0001042 -0.0000804 0.0001343 -0.1022055 -0.5297955 -0.1008121 0.0002178 -0.0870867 -0.8016027 -0.0006387 0.0001129 0.0015507 -0.2230097 -0.7812492 0.1165635 -0.0007321 0.0375131 -0.4358365 0.0007838 0.0011311 -0.0006372 -0.2012251 1.5445858 0.2720632 0.000002 0.3058971 1.2315748 -0.0004628 0.0000856 -0.000318 0.2009742 -0.5097249 -0.319731 0.0003227 -0.2397546 -0.1825096 0.0002506 -0.0007396 -0.000395 0.0464587 -0.0702572 0.323542 0.0000392 -0.0278602 -0.1491556 0.0001246 -0.0002975 -0.0001031 -0.0469189 0.7397322 -0.5163844 0.0003379 -0.144093 0.6399374 -0.00012 -0.0003119 -0.0002821 0.126273 0.8302155 -0.6471556 0.0001224 -0.7103456 0.2258041 -0.0000239 0.0002235 -0.0002975 -0.0785324 -0.2643092 0.1517355 -0.0000497 -0.0192001 0.0330522 0.0000876 0.0000168 0.0002456 -0.1427034 -0.0564246 0.0811479 0.0000999 0.198105 0.0635159 0.0000582 0.0000878 0.0001457 -0.0678803 0.1604045 -0.0136853 -0.0000381 0.0287016 0.1032153 -0.0000649 -0.0000449 0.0000296 0.1776093 0.0823232 0.0091849 -0.000008 -0.0000479 -0.0021081 -0.0000602 0.0000787 -0.0000989 0.1838177 0.0132478 -0.0439165 -0.0000758 -0.0368086 0.0947909 -0.0000447 -0.0001625 -0.0000825 0.1653269 unknown
polarizability: 129.4935405|-6.5390977|104.8709906|-0.0019096|-0.0026026|32.9882511 unknown
InChI: InChI=1S/C6H3ClFNO2/c7-4-1-2-5(8)6(3-4)9(10)11/h1-3H
charge 0 multiplicity 1
14 atoms
Cl 3.400877 -1.407155 0.000242
F  -1.486475 2.075635 -0.000434
O  -1.795589 -2.181688 0.001761
O  -2.896958 -0.180619 0.001081
N  -1.820854 -0.888185 -0.001712
C  -0.510151 -0.186269 -0.000886
C  0.653882 -0.989478 -0.000689
C  -0.385958 1.227623 -0.000282
C  1.914329 -0.37486 -0.000018
C  0.886789 1.828826 0.000438
C  2.047909 1.031643 0.000588
H  0.5355 -2.076396 -0.001092
H  0.952117 2.920544 0.000895
H  3.037583 1.49668 0.001208
