program: Orca
programVersion: 5.0.3
elementType: Cl Cl O O O C C C C C C C C C C C C C C C C C C C C C H H H H H H H H H H H H H H H H H H H H
charge: 0
multiplicity: 1
keywords: wb97x-d3
keywords: def2-TZVPP
keywords: def2/J RIJCOSX
keywords: DEFGRID2
keywords: scfconv7
keywords: smallprint printgap noloewdin
keywords: NOSOSCF
formula: C21H20Cl2O3
InChI: InChI=1/C21H20Cl2O3/c1-21(2)17(12-18(22)23)19(21)20(24)25-13-14-7-6-10-16(11-14)26-15-8-4-3-5-9-15/h3-12,17,19H,13H2,1-2H3
46 atoms
Cl 1.84942 -3.923005 -1.839713
Cl 4.733668 -3.77165 -1.929439
O  -1.088333 -0.731903 -1.350595
O  -0.96383 -1.938241 0.534391
O  -2.875012 2.894904 1.799924
C  1.786193 -0.365057 0.697051
C  2.006186 -1.802735 0.375689
C  1.016587 -1.015701 -0.447274
C  2.819101 0.64977 0.275326
C  1.081503 -0.007727 1.981027
C  3.254879 -2.277572 -0.260346
C  -0.424162 -1.301611 -0.34079
C  3.277274 -3.197091 -1.214388
C  -2.504037 -0.865977 -1.415826
C  -3.235488 0.263752 -0.739867
C  -2.641355 1.076563 0.217465
C  -4.568464 0.470777 -1.087091
C  -3.382501 2.091282 0.813954
C  -5.29757 1.477582 -0.475907
C  -4.710701 2.299784 0.473859
C  -1.53298 3.18095 1.859392
C  -0.816542 3.588298 0.740408
C  -0.926627 3.114526 3.105574
C  0.524175 3.917311 0.879874
C  0.411811 3.46082 3.232639
C  1.144266 3.855148 2.121907
H  1.560661 -2.509552 1.071695
H  1.34415 -0.711652 -1.435027
H  3.277023 0.408416 -0.684424
H  2.364384 1.637889 0.185884
H  3.614671 0.718966 1.01971
H  0.458906 -0.81312 2.366133
H  1.820789 0.227446 2.749469
H  0.45328 0.875362 1.848042
H  4.201841 -1.876084 0.082415
H  -2.746206 -0.873314 -2.478167
H  -2.823798 -1.825782 -1.005182
H  -1.608365 0.937006 0.508345
H  -5.034131 -0.154264 -1.839294
H  -6.332179 1.636126 -0.750102
H  -5.276003 3.092352 0.946853
H  -1.293411 3.653663 -0.229583
H  -1.498282 2.798622 3.969041
H  1.083506 4.232983 0.008869
H  0.883328 3.409165 4.205352
H  2.189519 4.115592 2.221671
elementType: Cl O C H
totalener: -1958.43413780 hartree
nucrepener: 2586.12564621 hartree
electener: -4544.55978401 hartree
oneelecener: -7825.98597190 hartree
twoeener: 3281.42618789 hartree
cpcmener: -0.03006750 hartree
kineticenergy: 1952.54561354 hartree
xcener: -143.508698694881 hartree
chargesum: 0.0000000
charge: -0.053081 -0.058210 -0.286410 -0.480448 -0.337828 0.182520 -0.037295 -0.140883 -0.306350 -0.235757 -0.218690 0.395989 0.070254 0.087653 0.004561 -0.199858 -0.236478 0.302184 -0.111872 -0.265131 0.295742 -0.194074 -0.226865 -0.149780 -0.128520 -0.192679 0.111396 0.111168 0.100647 0.098168 0.105356 0.104336 0.110009 0.012762 0.142753 0.126517 0.115425 0.143070 0.143885 0.159875 0.146822 0.158659 0.146523 0.164106 0.158819 0.161011
qa: -0.0531 -0.0582 -0.2864 -0.4804 -0.3378 0.1825 -0.0373 -0.1409 -0.3064 -0.2358 -0.2187 0.3960 0.0703 0.0877 0.0046 -0.1999 -0.2365 0.3022 -0.1119 -0.2651 0.2957 -0.1941 -0.2269 -0.1498 -0.1285 -0.1927 0.1114 0.1112 0.1006 0.0982 0.1054 0.1043 0.1100 0.0128 0.1428 0.1265 0.1154 0.1431 0.1439 0.1599 0.1468 0.1587 0.1465 0.1641 0.1588 0.1610
va: 1.2771 1.2482 2.1171 2.0146 2.0742 3.6268 3.8920 3.8207 3.9178 3.8693 3.9077 4.1741 4.1858 3.8312 3.7034 3.9294 3.9601 3.7139 3.8893 3.9990 3.6596 3.8884 3.9504 3.8231 3.8412 3.8386 1.0242 1.0259 1.0010 1.0082 0.9985 1.0236 1.0017 1.0285 1.0071 0.9937 1.0114 0.9727 1.0006 0.9880 1.0086 0.9948 1.0072 0.9886 0.9896 0.9899
dispcorr: -0.026972042 hartree
energy: -1958.461109837023
dipole: -11.99587 12.72399 0.72813 29.22989 -28.03303 1.19686 16.03238 -16.43840 -0.40602
magnitude: 1.45860 au
magnitude: 3.70746 debye
