program: Orca
programVersion: 5.0.3
elementType: Cl Cl O O O C C C C C C C C C C C C C C C C C C C C C H H H H H H H H H H H H H H H H H H H H
charge: 0
multiplicity: 1
keywords: wb97x-d3
keywords: def2-TZVPP
keywords: def2/J RIJCOSX
keywords: DEFGRID2
keywords: scfconv7
keywords: smallprint printgap noloewdin
keywords: NOSOSCF
formula: C21H20Cl2O3
InChI: InChI=1/C21H20Cl2O3/c1-21(2)17(12-18(22)23)19(21)20(24)25-13-14-7-6-10-16(11-14)26-15-8-4-3-5-9-15/h3-12,17,19H,13H2,1-2H3
46 atoms
Cl 3.107377 0.24775 -1.54603
Cl 4.34178 0.650732 1.030102
O  -1.370982 -2.036558 -0.884533
O  -2.055109 -2.71717 1.127907
O  -2.04274 2.628195 0.960904
C  1.288482 -3.422429 -0.00159
C  1.377615 -1.923024 -0.076567
C  0.267966 -2.572867 0.725795
C  2.251202 -4.184999 0.875351
C  0.91998 -4.169645 -1.259379
C  2.40663 -1.161672 0.644046
C  -1.158256 -2.461844 0.356442
C  3.172859 -0.218677 0.109453
C  -2.71144 -1.7267 -1.261069
C  -3.226382 -0.497038 -0.562192
C  -2.352761 0.503407 -0.149201
C  -4.592901 -0.350503 -0.355783
C  -2.854072 1.637655 0.475457
C  -5.080391 0.792463 0.261823
C  -4.218314 1.792609 0.682141
C  -0.817806 2.854386 0.376026
C  -0.704679 3.099751 -0.986675
C  0.295991 2.887402 1.200181
C  0.544853 3.37516 -1.521751
C  1.539705 3.175421 0.652881
C  1.669747 3.413624 -0.707694
H  1.079889 -1.505843 -1.031093
H  0.395444 -2.562389 1.802736
H  3.198649 -4.340137 0.356454
H  2.46237 -3.677758 1.815931
H  1.840851 -5.16679 1.116647
H  0.366477 -5.079313 -1.019853
H  0.322974 -3.581869 -1.952966
H  1.828982 -4.46757 -1.784499
H  2.551051 -1.372787 1.697112
H  -2.661404 -1.558765 -2.336918
H  -3.373817 -2.577356 -1.090991
H  -1.285678 0.396651 -0.300389
H  -5.274813 -1.131227 -0.668663
H  -6.144154 0.905143 0.42416
H  -4.596153 2.68064 1.172316
H  -1.578913 3.079969 -1.625283
H  0.191275 2.694896 2.260356
H  0.63592 3.564983 -2.583222
H  2.409328 3.20254 1.295669
H  2.640616 3.629269 -1.132513
elementType: Cl O C H
totalener: -1958.43403992 hartree
nucrepener: 2651.76171305 hartree
electener: -4610.19575297 hartree
oneelecener: -7957.43013454 hartree
twoeener: 3347.23438157 hartree
cpcmener: -0.03293373 hartree
kineticenergy: 1952.55546884 hartree
xcener: -143.509586332926 hartree
chargesum: -0.0000000
charge: -0.060879 -0.067047 -0.287084 -0.481492 -0.342233 0.095174 0.047818 -0.087967 -0.267696 -0.267273 -0.232920 0.406245 0.065578 0.077717 0.021847 -0.206102 -0.252399 0.295788 -0.103600 -0.271822 0.288570 -0.190566 -0.251897 -0.125933 -0.113716 -0.206577 0.085720 0.098716 0.100233 0.091480 0.099990 0.101920 0.094606 0.097276 0.136708 0.121546 0.121579 0.139383 0.143910 0.160459 0.147754 0.157464 0.147476 0.161877 0.153798 0.156572
qa: -0.0609 -0.0670 -0.2871 -0.4815 -0.3422 0.0952 0.0478 -0.0880 -0.2677 -0.2673 -0.2329 0.4062 0.0656 0.0777 0.0218 -0.2061 -0.2524 0.2958 -0.1036 -0.2718 0.2886 -0.1906 -0.2519 -0.1259 -0.1137 -0.2066 0.0857 0.0987 0.1002 0.0915 0.1000 0.1019 0.0946 0.0973 0.1367 0.1215 0.1216 0.1394 0.1439 0.1605 0.1478 0.1575 0.1475 0.1619 0.1538 0.1566
va: 1.2599 1.2363 2.1073 2.0165 2.0625 3.7453 3.7937 3.8547 3.9119 3.9067 3.9089 4.1491 4.1726 3.8010 3.6515 3.8968 3.9828 3.7001 3.8800 4.0087 3.6648 3.9283 4.0116 3.8581 3.7933 3.8504 1.0424 1.0316 1.0009 1.0043 1.0013 0.9997 1.0138 1.0002 1.0147 0.9933 1.0072 1.0134 1.0017 0.9872 1.0072 0.9963 1.0072 0.9881 1.0001 0.9977
dispcorr: -0.026525015 hartree
energy: -1958.460564935158
dipole: -15.90117 16.35861 0.45744 -16.68994 15.80132 -0.88861 -2.28589 1.09150 -1.19439
magnitude: 1.55739 au
magnitude: 3.95857 debye
