program: Orca
programVersion: 5.0.3
elementType: Cl Cl O O O C C C C C C C C C C C C C C C C C C C C C H H H H H H H H H H H H H H H H H H H H
charge: 0
multiplicity: 1
keywords: wb97x-d3
keywords: def2-TZVPP
keywords: def2/J RIJCOSX
keywords: DEFGRID2
keywords: scfconv7
keywords: smallprint printgap noloewdin
keywords: NOSOSCF
formula: C21H20Cl2O3
InChI: InChI=1/C21H20Cl2O3/c1-21(2)17(12-18(22)23)19(21)20(24)25-13-14-7-6-10-16(11-14)26-15-8-4-3-5-9-15/h3-12,17,19H,13H2,1-2H3
46 atoms
Cl 3.762102 -3.888801 0.939416
Cl 4.726843 -4.22747 -1.757981
O  -1.62491 -1.218665 -1.036021
O  -0.718901 -1.425781 1.00465
O  -2.830591 3.599416 0.159006
C  1.731263 -0.135473 -0.516124
C  1.972702 -1.601247 -0.29122
C  0.674733 -1.140276 -0.924578
C  2.423568 0.587612 -1.644955
C  1.531494 0.736333 0.699318
C  2.898789 -2.377939 -1.123427
C  -0.595193 -1.282689 -0.189089
C  3.683305 -3.359102 -0.696656
C  -2.955983 -1.300079 -0.535961
C  -3.596719 0.055256 -0.40913
C  -2.85468 1.205137 -0.164852
C  -4.981477 0.139522 -0.521871
C  -3.50771 2.423158 -0.02098
C  -5.618494 1.362153 -0.3802
C  -4.888151 2.511904 -0.1236
C  -1.670929 3.644486 0.891885
C  -0.650544 4.446533 0.401097
C  -1.536764 2.989115 2.109753
C  0.509622 4.607026 1.145571
C  -0.365633 3.148843 2.836851
C  0.659247 3.957521 2.362945
H  1.890478 -1.916516 0.742591
H  0.588219 -1.291693 -1.994426
H  2.46818 0.006121 -2.564629
H  1.891809 1.512983 -1.871884
H  3.443642 0.8527 -1.362407
H  2.487618 1.172171 0.99448
H  0.851158 1.560054 0.472549
H  1.141495 0.198261 1.560138
H  2.941049 -2.148231 -2.181575
H  -3.508383 -1.905129 -1.254071
H  -2.982897 -1.824871 0.420732
H  -1.774485 1.172138 -0.096271
H  -5.560601 -0.752003 -0.728754
H  -6.69466 1.423955 -0.473271
H  -5.380091 3.470041 -0.016293
H  -0.771954 4.951911 -0.548636
H  -2.335228 2.368623 2.496654
H  1.300332 5.240905 0.766077
H  -0.260474 2.640913 3.786469
H  1.565602 4.082017 2.940133
elementType: Cl O C H
totalener: -1958.43650129 hartree
nucrepener: 2527.07558406 hartree
electener: -4485.51208535 hartree
oneelecener: -7707.76217368 hartree
twoeener: 3222.25008833 hartree
cpcmener: -0.03004395 hartree
kineticenergy: 1952.55114583 hartree
xcener: -143.508748810999 hartree
chargesum: -0.0000000
charge: -0.058230 -0.062515 -0.286888 -0.480990 -0.338417 0.119841 0.024595 -0.071695 -0.273507 -0.261218 -0.200742 0.392513 0.037620 0.085738 0.029443 -0.211134 -0.233204 0.279932 -0.110355 -0.263189 0.283118 -0.233865 -0.192247 -0.120516 -0.147416 -0.197909 0.077921 0.096490 0.094127 0.098974 0.101390 0.109397 0.047629 0.101355 0.132352 0.122430 0.113813 0.158168 0.142421 0.160580 0.146624 0.147478 0.158087 0.161023 0.161407 0.159570
qa: -0.0582 -0.0625 -0.2869 -0.4810 -0.3384 0.1198 0.0246 -0.0717 -0.2735 -0.2612 -0.2007 0.3925 0.0376 0.0857 0.0294 -0.2111 -0.2332 0.2799 -0.1104 -0.2632 0.2831 -0.2339 -0.1922 -0.1205 -0.1474 -0.1979 0.0779 0.0965 0.0941 0.0990 0.1014 0.1094 0.0476 0.1014 0.1324 0.1224 0.1138 0.1582 0.1424 0.1606 0.1466 0.1475 0.1581 0.1610 0.1614 0.1596
va: 1.2677 1.2423 2.1216 2.0172 2.0683 3.7162 3.8955 3.8362 3.9075 3.8939 3.8982 4.2002 4.2083 3.8336 3.6705 3.9358 3.9620 3.7438 3.8862 4.0058 3.6707 3.9791 3.8921 3.8530 3.8355 3.8652 1.0501 1.0344 1.0057 1.0001 1.0008 1.0023 1.0162 1.0177 1.0178 0.9953 1.0131 0.9782 1.0024 0.9878 1.0077 1.0074 0.9961 0.9879 0.9903 0.9910
dispcorr: -0.024781033 hartree
energy: -1958.461282327376
dipole: -19.77874 19.35471 -0.42402 30.59387 -29.91793 0.67594 1.74980 -2.74598 -0.99618
magnitude: 1.27635 au
magnitude: 3.24423 debye
