program: Orca
programVersion: 5.0.3
elementType: Cl Cl O O O C C C C C C C C C C C C C C C C C C C C C H H H H H H H H H H H H H H H H H H H H
charge: 0
multiplicity: 1
keywords: wb97x-d3
keywords: def2-TZVPP
keywords: def2/J RIJCOSX
keywords: DEFGRID2
keywords: scfconv7
keywords: smallprint printgap noloewdin
keywords: NOSOSCF
formula: C21H20Cl2O3
InChI: InChI=1/C21H20Cl2O3/c1-21(2)17(12-18(22)23)19(21)20(24)25-13-14-7-6-10-16(11-14)26-15-8-4-3-5-9-15/h3-12,17,19H,13H2,1-2H3
46 atoms
Cl 3.596443 0.305118 -1.225955
Cl 4.303095 0.532975 1.560634
O  -2.017178 -2.193793 0.149857
O  -0.914243 -2.025323 -1.795802
O  -2.457017 2.961365 -0.231878
C  1.368012 -3.423967 -0.148976
C  1.62506 -1.948694 -0.252272
C  0.276556 -2.448587 0.237097
C  1.973575 -4.213383 0.986706
C  1.282157 -4.213858 -1.432054
C  2.487021 -1.232551 0.69423
C  -0.914805 -2.205016 -0.599509
C  3.342065 -0.269062 0.375594
C  -3.283458 -1.88985 -0.449092
C  -3.704084 -0.489556 -0.101705
C  -2.851982 0.584725 -0.341335
C  -4.959515 -0.260293 0.44957
C  -3.251656 1.86825 -0.000749
C  -5.362431 1.033837 0.749735
C  -4.509256 2.104567 0.538599
C  -1.102534 2.888015 -0.015642
C  -0.553533 2.189096 1.053588
C  -0.290994 3.60475 -0.883594
C  0.821987 2.204624 1.237678
C  1.081238 3.622663 -0.677812
C  1.644886 2.920547 0.378142
H  1.62204 -1.56466 -1.265931
H  0.098638 -2.368447 1.303289
H  3.015103 -4.455262 0.768274
H  1.942213 -3.687488 1.939786
H  1.435606 -5.153656 1.11664
H  0.576183 -5.039978 -1.330459
H  0.984154 -3.615249 -2.28916
H  2.259515 -4.643326 -1.65821
H  2.420947 -1.497483 1.742765
H  -3.245935 -2.033328 -1.529232
H  -3.992162 -2.60999 -0.041955
H  -1.881609 0.429971 -0.797134
H  -5.623149 -1.093205 0.644661
H  -6.342969 1.209383 1.172108
H  -4.81223 3.113322 0.788252
H  -1.1824 1.638728 1.741646
H  -0.73129 4.147993 -1.710081
H  1.248556 1.659464 2.069718
H  1.711338 4.185497 -1.353954
H  2.715222 2.934421 0.531539
elementType: Cl O C H
totalener: -1958.43599552 hartree
nucrepener: 2622.74933064 hartree
electener: -4581.18532617 hartree
oneelecener: -7899.45461695 hartree
twoeener: 3318.26929078 hartree
cpcmener: -0.02980247 hartree
kineticenergy: 1952.54418770 hartree
xcener: -143.506948464074 hartree
chargesum: 0.0000000
charge: -0.058188 -0.063018 -0.287010 -0.496180 -0.340967 0.088237 0.041681 -0.073107 -0.267907 -0.271183 -0.213508 0.416191 0.044964 0.098139 0.006649 -0.197883 -0.237595 0.272288 -0.104028 -0.259031 0.304015 -0.204215 -0.259292 -0.132719 -0.129379 -0.181572 0.078556 0.098704 0.100737 0.092105 0.098897 0.101982 0.093156 0.098055 0.134536 0.116188 0.116146 0.154830 0.146964 0.161342 0.147702 0.155762 0.147522 0.153608 0.159683 0.148143
qa: -0.0582 -0.0630 -0.2870 -0.4962 -0.3410 0.0882 0.0417 -0.0731 -0.2679 -0.2712 -0.2135 0.4162 0.0450 0.0981 0.0066 -0.1979 -0.2376 0.2723 -0.1040 -0.2590 0.3040 -0.2042 -0.2593 -0.1327 -0.1294 -0.1816 0.0786 0.0987 0.1007 0.0921 0.0989 0.1020 0.0932 0.0981 0.1345 0.1162 0.1161 0.1548 0.1470 0.1613 0.1477 0.1558 0.1475 0.1536 0.1597 0.1481
va: 1.2642 1.2398 2.1300 1.9981 2.0640 3.7472 3.8327 3.8519 3.9108 3.9039 3.8948 4.1535 4.1821 3.7999 3.7357 3.9120 3.9662 3.7408 3.8805 4.0202 3.6579 3.9323 4.0218 3.8221 3.9317 3.8327 1.0503 1.0341 1.0003 1.0056 1.0011 0.9988 1.0189 0.9999 1.0175 1.0180 1.0009 1.0105 1.0029 0.9875 1.0062 0.9985 1.0073 0.9964 0.9894 1.0114
dispcorr: -0.025972406 hartree
energy: -1958.461967926813
dipole: -18.28294 17.71540 -0.56754 -18.28664 16.70069 -1.58595 1.03420 0.30563 1.33983
magnitude: 2.15232 au
magnitude: 5.47077 debye
