program: Orca
programVersion: 5.0.3
elementType: Cl Cl O O O C C C C C C C C C C C C C C C C C C C C C H H H H H H H H H H H H H H H H H H H H
charge: 0
multiplicity: 1
keywords: wb97x-d3
keywords: def2-TZVPP
keywords: def2/J RIJCOSX
keywords: DEFGRID2
keywords: scfconv7
keywords: smallprint printgap noloewdin
keywords: NOSOSCF
formula: C21H20Cl2O3
InChI: InChI=1/C21H20Cl2O3/c1-21(2)17(12-18(22)23)19(21)20(24)25-13-14-7-6-10-16(11-14)26-15-8-4-3-5-9-15/h3-12,17,19H,13H2,1-2H3
46 atoms
Cl 1.338927 0.17369 1.82623
Cl 4.191442 0.492193 1.66331
O  -1.630881 -2.209642 0.590328
O  -1.184091 -1.829157 -1.565206
O  -2.016095 2.831655 0.196391
C  1.579985 -3.110512 -0.918733
C  1.695045 -1.628471 -0.788249
C  0.593967 -2.34707 -0.045707
C  2.55327 -3.974788 -0.153261
C  1.16778 -3.707972 -2.240917
C  2.834424 -0.996505 -0.091991
C  -0.801657 -2.102257 -0.450736
C  2.777895 -0.220281 0.979622
C  -3.020602 -1.986255 0.357794
C  -3.346411 -0.57198 -0.03583
C  -2.517806 0.486277 0.308689
C  -4.516474 -0.322193 -0.745347
C  -2.835325 1.771741 -0.106093
C  -4.847248 0.973435 -1.108663
C  -4.000624 2.031068 -0.806688
C  -0.672261 2.737158 -0.075122
C  0.175942 3.490116 0.724165
C  -0.167089 1.975108 -1.123141
C  1.540755 3.476105 0.476245
C  1.200972 1.971364 -1.355537
C  2.061232 2.715725 -0.560728
H  1.363012 -1.06817 -1.660057
H  0.733524 -2.492291 1.018229
H  3.472697 -4.113192 -0.725162
H  2.821815 -3.546817 0.813073
H  2.12492 -4.961778 0.02842
H  2.060843 -3.997682 -2.79777
H  0.568383 -4.60811 -2.093894
H  0.603153 -3.02227 -2.867337
H  3.813106 -1.151611 -0.532873
H  -3.397442 -2.683244 -0.393294
H  -3.499417 -2.237947 1.303837
H  -1.610831 0.321098 0.875889
H  -5.165768 -1.143546 -1.022082
H  -5.758685 1.161269 -1.659192
H  -4.238003 3.039519 -1.118418
H  -0.229884 4.079988 1.536277
H  -0.818902 1.389141 -1.758381
H  2.198907 4.059821 1.106519
H  1.592948 1.376681 -2.170637
H  3.126899 2.69814 -0.744873
elementType: Cl O C H
totalener: -1958.43236062 hartree
nucrepener: 2741.41002319 hartree
electener: -4699.84238382 hartree
oneelecener: -8137.34365542 hartree
twoeener: 3437.50127160 hartree
cpcmener: -0.02933345 hartree
kineticenergy: 1952.59123378 hartree
xcener: -143.519929168866 hartree
chargesum: -0.0000000
charge: -0.053393 -0.070736 -0.294364 -0.485487 -0.345429 0.122037 -0.036360 -0.044951 -0.280278 -0.277120 -0.271140 0.367939 0.156490 0.090049 0.032875 -0.230090 -0.224025 0.275675 -0.119994 -0.247593 0.306111 -0.250166 -0.199638 -0.128404 -0.143232 -0.194333 0.098356 0.110854 0.101196 0.093564 0.101461 0.095979 0.102386 0.092863 0.132139 0.119953 0.127153 0.144575 0.144769 0.161007 0.148037 0.146253 0.148985 0.156215 0.166504 0.153308
qa: -0.0534 -0.0707 -0.2944 -0.4855 -0.3454 0.1220 -0.0364 -0.0450 -0.2803 -0.2771 -0.2711 0.3679 0.1565 0.0900 0.0329 -0.2301 -0.2240 0.2757 -0.1200 -0.2476 0.3061 -0.2502 -0.1996 -0.1284 -0.1432 -0.1943 0.0984 0.1109 0.1012 0.0936 0.1015 0.0960 0.1024 0.0929 0.1321 0.1200 0.1272 0.1446 0.1448 0.1610 0.1480 0.1463 0.1490 0.1562 0.1665 0.1533
va: 1.2859 1.2349 2.1181 2.0036 2.0634 3.7759 3.8469 3.7950 3.9178 3.8885 3.9382 4.1421 4.1276 3.7849 3.5965 3.9505 3.9599 3.6979 3.8746 4.0168 3.6619 3.9827 3.8546 3.8883 3.8331 3.8239 1.0252 1.0296 1.0005 0.9976 1.0021 1.0009 0.9982 1.0197 1.0174 1.0078 0.9914 1.0137 1.0005 0.9875 1.0048 1.0070 1.0083 0.9896 0.9857 0.9971
dispcorr: -0.030334748 hartree
energy: -1958.462695370774
dipole: -8.37392 8.78333 0.40941 -16.56925 14.99177 -1.57748 -16.97138 16.85796 -0.11342
magnitude: 1.63368 au
magnitude: 4.15250 debye
