program: Orca
programVersion: 5.0.3
elementType: Cl Cl O O O C C C C C C C C C C C C C C C C C C C C C H H H H H H H H H H H H H H H H H H H H
charge: 0
multiplicity: 1
keywords: wb97x-d3
keywords: def2-TZVPP
keywords: def2/J RIJCOSX
keywords: DEFGRID2
keywords: scfconv7
keywords: smallprint printgap noloewdin
keywords: NOSOSCF
formula: C21H20Cl2O3
InChI: InChI=1/C21H20Cl2O3/c1-21(2)17(12-18(22)23)19(21)20(24)25-13-14-7-6-10-16(11-14)26-15-8-4-3-5-9-15/h3-12,17,19H,13H2,1-2H3
46 atoms
Cl 1.731922 -3.238084 -2.699394
Cl 4.549588 -3.759886 -2.3395
O  -0.635377 -0.173447 -1.544046
O  -1.203169 -1.801398 -0.121639
O  -2.926511 3.404593 1.410386
C  1.639333 -1.161243 1.120214
C  1.717767 -2.352821 0.231238
C  1.078516 -1.086697 -0.293563
C  2.882712 -0.337523 1.352131
C  0.725678 -1.213285 2.318415
C  2.987389 -2.814781 -0.371271
C  -0.360262 -1.082083 -0.607336
C  3.078361 -3.222064 -1.628878
C  -1.995503 -0.046046 -1.969876
C  -2.872953 0.563304 -0.914057
C  -2.455654 1.706044 -0.239479
C  -4.112612 0.004961 -0.627406
C  -3.27311 2.263451 0.733386
C  -4.93378 0.591137 0.325166
C  -4.515937 1.715189 1.020269
C  -1.62448 3.607549 1.795562
C  -0.821743 2.579407 2.275525
C  -1.15097 4.910704 1.743962
C  0.469281 2.86854 2.693291
C  0.138259 5.186423 2.177494
C  0.956648 4.168112 2.646614
H  1.015382 -3.149727 0.464161
H  1.682152 -0.502398 -0.978507
H  3.487374 -0.773438 2.150199
H  3.508127 -0.260765 0.461593
H  2.61456 0.676207 1.655974
H  0.34246 -0.220076 2.560587
H  -0.12269 -1.880134 2.183339
H  1.286388 -1.569704 3.184381
H  3.882919 -2.83902 0.23913
H  -1.944019 0.599967 -2.846693
H  -2.389686 -1.011809 -2.292067
H  -1.497628 2.155418 -0.472173
H  -4.435037 -0.888634 -1.146855
H  -5.899668 0.156999 0.546811
H  -5.14551 2.163771 1.777868
H  -1.190702 1.562948 2.330344
H  -1.787902 5.702728 1.371347
H  1.094433 2.066556 3.064972
H  0.504474 6.203772 2.137062
H  1.963702 4.384903 2.976432
elementType: Cl O C H
totalener: -1958.43358119 hartree
nucrepener: 2566.90931914 hartree
electener: -4525.34290033 hartree
oneelecener: -7787.66322945 hartree
twoeener: 3262.32032911 hartree
cpcmener: -0.03120816 hartree
kineticenergy: 1952.56694498 hartree
xcener: -143.508253922511 hartree
chargesum: 0.0000000
charge: -0.053694 -0.057561 -0.291739 -0.489370 -0.342631 0.146429 -0.036087 -0.139353 -0.281667 -0.275307 -0.217641 0.421071 0.075838 0.107009 0.031353 -0.244943 -0.226019 0.284991 -0.113578 -0.259915 0.296552 -0.195025 -0.263187 -0.136791 -0.113944 -0.212384 0.111878 0.112416 0.103678 0.095441 0.095109 0.085137 0.095726 0.104555 0.142506 0.125306 0.116930 0.142027 0.146292 0.161578 0.149216 0.162510 0.147845 0.168474 0.160922 0.160047
qa: -0.0537 -0.0576 -0.2917 -0.4894 -0.3426 0.1464 -0.0361 -0.1394 -0.2817 -0.2753 -0.2176 0.4211 0.0758 0.1070 0.0314 -0.2449 -0.2260 0.2850 -0.1136 -0.2599 0.2966 -0.1950 -0.2632 -0.1368 -0.1139 -0.2124 0.1119 0.1124 0.1037 0.0954 0.0951 0.0851 0.0957 0.1046 0.1425 0.1253 0.1169 0.1420 0.1463 0.1616 0.1492 0.1625 0.1478 0.1685 0.1609 0.1600
va: 1.2785 1.2491 2.1081 2.0120 2.0664 3.6888 3.8814 3.8251 3.9183 3.8864 3.9111 4.1117 4.1779 3.7876 3.6136 3.9331 3.9564 3.6997 3.8867 4.0149 3.7154 3.8946 4.0106 3.8599 3.8756 3.9460 1.0235 1.0255 0.9991 1.0002 1.0072 1.0033 1.0207 1.0020 1.0077 0.9926 1.0084 1.0162 1.0029 0.9876 1.0057 0.9916 1.0076 0.9840 0.9872 0.9916
dispcorr: -0.025381110 hartree
energy: -1958.458962300654
dipole: -11.09590 12.05674 0.96084 21.63339 -20.99534 0.63805 24.83426 -24.40328 0.43098
magnitude: 1.23128 au
magnitude: 3.12968 debye
