program: Orca
programVersion: 5.0.3
elementType: Cl Cl O O O C C C C C C C C C C C C C C C C C C C C C H H H H H H H H H H H H H H H H H H H H
charge: 0
multiplicity: 1
keywords: wb97x-d3
keywords: def2-TZVPP
keywords: def2/J RIJCOSX
keywords: DEFGRID2
keywords: scfconv7
keywords: smallprint printgap noloewdin
keywords: NOSOSCF
formula: C21H20Cl2O3
InChI: InChI=1/C21H20Cl2O3/c1-21(2)17(12-18(22)23)19(21)20(24)25-13-14-7-6-10-16(11-14)26-15-8-4-3-5-9-15/h3-12,17,19H,13H2,1-2H3
46 atoms
Cl 2.61504 0.892651 0.584049
Cl 4.978446 -0.639295 1.217202
O  -1.430431 -1.91078 0.314656
O  -1.351955 -3.967114 1.172436
O  -2.197503 2.8090 -1.127437
C  0.989842 -2.817678 -1.342519
C  1.378427 -1.877596 -0.238102
C  0.56879 -3.121338 0.081993
C  2.018918 -3.75167 -1.932995
C  -0.004674 -2.329272 -2.367918
C  2.752782 -1.785508 0.268259
C  -0.821301 -3.055504 0.576272
C  3.354575 -0.661875 0.637974
C  -2.784425 -1.740052 0.722452
C  -3.299198 -0.450451 0.150436
C  -2.449042 0.590874 -0.204298
C  -4.674857 -0.298843 0.002504
C  -2.985987 1.773035 -0.70029
C  -5.19481 0.885955 -0.493585
C  -4.355734 1.931774 -0.847032
C  -1.020718 3.105132 -0.48521
C  -0.919883 3.128678 0.900627
C  0.060065 3.454104 -1.282007
C  0.281889 3.504114 1.483208
C  1.251385 3.841601 -0.684757
C  1.369123 3.866016 0.697968
H  0.819864 -0.949435 -0.225742
H  1.11706 -3.936313 0.540861
H  1.522748 -4.573561 -2.451263
H  2.635409 -3.224621 -2.663175
H  2.680629 -4.190269 -1.187431
H  -0.639294 -1.521817 -2.011313
H  0.534777 -1.953941 -3.238874
H  -0.646189 -3.144242 -2.707171
H  3.326958 -2.699921 0.35752
H  -3.398071 -2.574116 0.376572
H  -2.837648 -1.718796 1.814581
H  -1.376087 0.489534 -0.103018
H  -5.339058 -1.111691 0.268564
H  -6.264537 0.997644 -0.611355
H  -4.757404 2.85662 -1.240624
H  -1.765062 2.864625 1.523633
H  -0.034393 3.43209 -2.360256
H  0.362667 3.521157 2.562017
H  2.091793 4.119123 -1.30733
H  2.299955 4.164813 1.160946
elementType: Cl O C H
totalener: -1958.43446170 hartree
nucrepener: 2608.76342991 hartree
electener: -4567.19789160 hartree
oneelecener: -7870.73016492 hartree
twoeener: 3303.53227332 hartree
cpcmener: -0.03102733 hartree
kineticenergy: 1952.55991725 hartree
xcener: -143.511427379846 hartree
chargesum: 0.0000000
charge: -0.058568 -0.067377 -0.267801 -0.496789 -0.340026 0.088257 0.067427 -0.083211 -0.271491 -0.260956 -0.221556 0.421569 0.049815 0.078878 0.034726 -0.229744 -0.243919 0.282255 -0.121233 -0.257089 0.301779 -0.203442 -0.261128 -0.107515 -0.096009 -0.258263 0.070932 0.096696 0.098420 0.100391 0.093201 0.085159 0.096992 0.103374 0.130094 0.112347 0.125270 0.159407 0.143632 0.160184 0.147702 0.157306 0.148695 0.163090 0.161516 0.167007
qa: -0.0586 -0.0674 -0.2678 -0.4968 -0.3400 0.0883 0.0674 -0.0832 -0.2715 -0.2610 -0.2216 0.4216 0.0498 0.0789 0.0347 -0.2297 -0.2439 0.2823 -0.1212 -0.2571 0.3018 -0.2034 -0.2611 -0.1075 -0.0960 -0.2583 0.0709 0.0967 0.0984 0.1004 0.0932 0.0852 0.0970 0.1034 0.1301 0.1123 0.1253 0.1594 0.1436 0.1602 0.1477 0.1573 0.1487 0.1631 0.1615 0.1670
va: 1.2861 1.2393 2.1313 2.0040 2.0672 3.7220 3.8563 3.8652 3.9137 3.9153 3.9002 4.1433 4.2089 3.8210 3.7297 3.8979 3.9747 3.7149 3.8912 4.0006 3.6589 3.9118 4.0092 3.8164 3.8024 3.8363 1.0026 1.0299 1.0007 1.0001 1.0059 1.0077 1.0010 0.9998 1.0185 1.0017 0.9909 0.9989 1.0014 0.9879 1.0064 0.9966 1.0067 0.9877 0.9878 0.9919
dispcorr: -0.025006670 hartree
energy: -1958.459468366841
dipole: -19.57372 19.45444 -0.11928 -9.01392 8.94469 -0.06922 -13.09193 12.43252 -0.65941
magnitude: 0.67368 au
magnitude: 1.71235 debye
