program: Orca
programVersion: 5.0.3
elementType: Cl Cl O O O C C C C C C C C C C C C C C C C C C C C C H H H H H H H H H H H H H H H H H H H H
charge: 0
multiplicity: 1
keywords: wb97x-d3
keywords: def2-TZVPP
keywords: def2/J RIJCOSX
keywords: DEFGRID2
keywords: scfconv7
keywords: smallprint printgap noloewdin
keywords: NOSOSCF
formula: C21H20Cl2O3
InChI: InChI=1/C21H20Cl2O3/c1-21(2)17(12-18(22)23)19(21)20(24)25-13-14-7-6-10-16(11-14)26-15-8-4-3-5-9-15/h3-12,17,19H,13H2,1-2H3
46 atoms
Cl 4.752481 -2.470212 0.900947
Cl 4.669049 -5.044656 -0.399174
O  -1.605393 -1.681726 0.338684
O  0.076753 -0.433936 1.136815
O  -2.864256 3.532909 -0.624357
C  1.271305 -1.300841 -1.668385
C  1.980409 -1.978016 -0.527371
C  0.469852 -2.02505 -0.606072
C  1.27558 -1.928546 -3.041286
C  1.296536 0.207326 -1.711854
C  2.723556 -3.230471 -0.708158
C  -0.337457 -1.284859 0.386593
C  3.889181 -3.52802 -0.147898
C  -2.578636 -1.050661 1.185339
C  -3.296145 0.042677 0.445772
C  -2.71245 1.29973 0.299195
C  -4.542559 -0.209109 -0.115792
C  -3.386717 2.293574 -0.397486
C  -5.204406 0.790641 -0.815105
C  -4.635007 2.044301 -0.956286
C  -1.978558 4.10535 0.24775
C  -0.882328 4.753324 -0.303294
C  -2.190472 4.111773 1.621267
C  0.007708 5.417272 0.528866
C  -1.283879 4.766405 2.442157
C  -0.184466 5.421775 1.903206
H  2.376551 -1.299798 0.219912
H  0.031119 -2.961602 -0.932053
H  0.453216 -1.529472 -3.637835
H  2.205654 -1.700281 -3.565586
H  1.162021 -3.011761 -3.019151
H  1.393936 0.666779 -0.730546
H  2.144466 0.541591 -2.312809
H  0.388925 0.596297 -2.178482
H  2.284121 -3.990739 -1.343146
H  -3.27602 -1.84252 1.45551
H  -2.115267 -0.682437 2.10084
H  -1.740197 1.495817 0.733086
H  -4.9990 -1.184746 -0.003029
H  -6.176325 0.595349 -1.249308
H  -5.149283 2.82872 -1.497326
H  -0.734173 4.744795 -1.375992
H  -3.052567 3.617343 2.051312
H  0.858681 5.92794 0.096756
H  -1.44643 4.769005 3.512319
H  0.515179 5.934439 2.550123
elementType: Cl O C H
totalener: -1958.44950135 hartree
nucrepener: 2468.62874438 hartree
electener: -4427.07824572 hartree
oneelecener: -7591.19636666 hartree
twoeener: 3164.11812094 hartree
cpcmener: -0.02450586 hartree
kineticenergy: 1952.55848731 hartree
xcener: -143.504648506631 hartree
chargesum: -0.0000000
charge: -0.056634 -0.061844 -0.278342 -0.464201 -0.326928 0.089197 0.028929 -0.085131 -0.263145 -0.269906 -0.202670 0.403445 0.038306 0.073786 -0.020448 -0.191803 -0.225077 0.298077 -0.106965 -0.260816 0.297736 -0.253815 -0.206787 -0.117386 -0.135716 -0.186831 0.077486 0.096318 0.098890 0.100499 0.089722 0.094317 0.099134 0.098850 0.128753 0.115394 0.120120 0.146646 0.141781 0.157266 0.144938 0.145071 0.155667 0.157324 0.159030 0.157763
qa: -0.0566 -0.0618 -0.2783 -0.4642 -0.3269 0.0892 0.0289 -0.0851 -0.2631 -0.2699 -0.2027 0.4034 0.0383 0.0738 -0.0204 -0.1918 -0.2251 0.2981 -0.1070 -0.2608 0.2977 -0.2538 -0.2068 -0.1174 -0.1357 -0.1868 0.0775 0.0963 0.0989 0.1005 0.0897 0.0943 0.0991 0.0988 0.1288 0.1154 0.1201 0.1466 0.1418 0.1573 0.1449 0.1451 0.1557 0.1573 0.1590 0.1578
va: 1.2690 1.2428 2.1337 2.0451 2.0822 3.7384 3.8639 3.8350 3.9028 3.9050 3.8917 4.2030 4.2111 3.8080 3.7129 3.8651 3.9786 3.7368 3.8915 4.0158 3.6736 4.0105 3.9252 3.8788 3.8856 3.9103 1.0502 1.0336 1.0013 1.0011 1.0059 1.0183 1.0014 0.9997 1.0186 0.9988 1.0144 1.0232 1.0033 0.9888 1.0081 1.0086 0.9973 0.9892 0.9899 0.9907
dispcorr: -0.022092798 hartree
energy: -1958.471594144731
dipole: -26.86969 25.57360 -1.29609 23.00498 -23.26872 -0.26374 -9.17768 8.47642 -0.70125
magnitude: 1.49705 au
magnitude: 3.80520 debye
