program: Orca
programVersion: 5.0.3
elementType: Cl Cl O O O C C C C C C C C C C C C C C C C C C C C C H H H H H H H H H H H H H H H H H H H H
charge: 0
multiplicity: 1
keywords: wb97x-d3
keywords: def2-TZVPP
keywords: def2/J RIJCOSX
keywords: DEFGRID2
keywords: scfconv7
keywords: smallprint printgap noloewdin
keywords: NOSOSCF
formula: C21H20Cl2O3
InChI: InChI=1/C21H20Cl2O3/c1-21(2)17(12-18(22)23)19(21)20(24)25-13-14-7-6-10-16(11-14)26-15-8-4-3-5-9-15/h3-12,17,19H,13H2,1-2H3
46 atoms
Cl 3.45573 -3.291319 1.959831
Cl 4.69435 -4.971697 -0.034188
O  -1.091012 -1.801744 0.420244
O  -1.948991 -2.429134 -1.545366
O  -1.893918 3.326084 1.360174
C  1.369262 -1.228453 -1.436237
C  1.618966 -2.317545 -0.425236
C  0.395799 -2.381795 -1.316173
C  2.180293 -1.169647 -2.708343
C  1.003961 0.138619 -0.909593
C  2.673014 -3.319807 -0.624079
C  -0.993813 -2.209879 -0.837885
C  3.491949 -3.785204 0.310635
C  -2.392646 -1.459013 0.923439
C  -2.783345 -0.077134 0.485567
C  -2.166423 1.018808 1.080015
C  -3.717993 0.126975 -0.522928
C  -2.487069 2.304907 0.675071
C  -4.033097 1.418847 -0.921151
C  -3.425167 2.515283 -0.329773
C  -1.535393 4.486206 0.732106
C  -0.950635 4.50405 -0.528963
C  -1.715117 5.663792 1.4449
C  -0.552918 5.717345 -1.072972
C  -1.301898 6.867448 0.893134
C  -0.724734 6.901556 -0.368957
H  1.439219 -2.026511 0.602866
H  0.445637 -3.089283 -2.136886
H  3.152229 -0.707309 -2.524043
H  2.353157 -2.148797 -3.152867
H  1.661307 -0.563776 -3.453537
H  1.898997 0.762015 -0.861241
H  0.292731 0.635726 -1.573647
H  0.574446 0.114519 0.08982
H  2.799712 -3.725813 -1.620834
H  -3.132116 -2.201127 0.620959
H  -2.287363 -1.507383 2.006337
H  -1.440338 0.876965 1.872566
H  -4.204493 -0.717696 -0.993088
H  -4.767215 1.577749 -1.700382
H  -3.691959 3.516751 -0.642764
H  -0.795123 3.587131 -1.083769
H  -2.168087 5.634277 2.428087
H  -0.097164 5.730942 -2.054897
H  -1.440383 7.78302 1.453555
H  -0.408418 7.842497 -0.799487
elementType: Cl O C H
totalener: -1958.44789193 hartree
nucrepener: 2471.27989270 hartree
electener: -4429.72778464 hartree
oneelecener: -7595.85763832 hartree
twoeener: 3166.12985368 hartree
cpcmener: -0.02566350 hartree
kineticenergy: 1952.55976549 hartree
xcener: -143.505297257262 hartree
chargesum: 0.0000000
charge: -0.057103 -0.061968 -0.272483 -0.461183 -0.326559 0.101029 0.052827 -0.091867 -0.270294 -0.292262 -0.221488 0.403810 0.042857 0.062800 0.032809 -0.332225 -0.168838 0.303562 -0.148914 -0.188863 0.284090 -0.188016 -0.245823 -0.153683 -0.124530 -0.180711 0.081928 0.097142 0.099914 0.090897 0.098906 0.101596 0.107375 0.095252 0.127829 0.116260 0.122253 0.134812 0.140445 0.158634 0.155894 0.156276 0.144594 0.158252 0.157350 0.157417
qa: -0.0571 -0.0620 -0.2725 -0.4612 -0.3266 0.1010 0.0528 -0.0919 -0.2703 -0.2923 -0.2215 0.4038 0.0429 0.0628 0.0328 -0.3322 -0.1688 0.3036 -0.1489 -0.1889 0.2841 -0.1880 -0.2458 -0.1537 -0.1245 -0.1807 0.0819 0.0971 0.0999 0.0909 0.0989 0.1016 0.1074 0.0953 0.1278 0.1163 0.1223 0.1348 0.1404 0.1586 0.1559 0.1563 0.1446 0.1583 0.1573 0.1574
va: 1.2688 1.2428 2.1275 2.0414 2.0758 3.7216 3.8284 3.8269 3.9068 3.9118 3.8878 4.2169 4.2115 3.8212 3.6047 4.0301 3.9388 3.7102 3.9318 3.9180 3.6903 3.8979 4.0046 3.9044 3.8882 3.9006 1.0430 1.0307 1.0008 1.0061 1.0006 1.0020 0.9968 1.0099 1.0201 1.0092 0.9975 1.0201 1.0155 0.9910 0.9961 0.9973 1.0086 0.9909 0.9893 0.9905
dispcorr: -0.023430332 hartree
energy: -1958.471322266548
dipole: -20.52428 20.46472 -0.05955 31.17241 -29.95762 1.21479 -14.97371 14.49397 -0.47974
magnitude: 1.30745 au
magnitude: 3.32327 debye
