program: Orca
programVersion: 5.0.3
elementType: Cl Cl O O O C C C C C C C C C C C C C C C C C C C C C H H H H H H H H H H H H H H H H H H H H
charge: 0
multiplicity: 1
keywords: wb97x-d3
keywords: def2-TZVPP
keywords: def2/J RIJCOSX
keywords: DEFGRID2
keywords: scfconv7
keywords: smallprint printgap noloewdin
keywords: NOSOSCF
formula: C21H20Cl2O3
InChI: InChI=1/C21H20Cl2O3/c1-21(2)17(12-18(22)23)19(21)20(24)25-13-14-7-6-10-16(11-14)26-15-8-4-3-5-9-15/h3-12,17,19H,13H2,1-2H3
46 atoms
Cl 2.87002 -0.395314 -2.095555
Cl 4.772137 -0.733732 0.045329
O  -1.765083 -2.470551 1.100305
O  -1.613008 -2.521109 -1.127403
O  -0.780531 2.438174 0.895962
C  0.944381 -4.246774 -0.621205
C  1.350588 -2.808068 -0.742489
C  0.243536 -3.208409 0.225362
C  1.82328 -5.216782 0.132134
C  0.258696 -4.883029 -1.805471
C  2.605491 -2.288997 -0.189043
C  -1.120808 -2.71116 -0.042066
C  3.309767 -1.279549 -0.685927
C  -3.045669 -1.843306 1.014012
C  -2.951863 -0.432207 0.503068
C  -1.939543 0.408932 0.951226
C  -3.888922 0.046926 -0.403466
C  -1.853183 1.707936 0.472361
C  -3.805048 1.35454 -0.859732
C  -2.785084 2.193278 -0.438182
C  -0.868491 3.794091 1.05024
C  0.211275 4.549728 0.616001
C  -1.952509 4.399821 1.674112
C  0.205676 5.923753 0.809478
C  -1.949683 5.775969 1.849776
C  -0.874994 6.543633 1.420864
H  0.994625 -2.31812 -1.641627
H  0.516413 -3.216572 1.274509
H  2.652198 -5.551088 -0.494667
H  2.242706 -4.79923 1.046838
H  1.247051 -6.099151 0.416402
H  1.002617 -5.386759 -2.42545
H  -0.460868 -5.636581 -1.47937
H  -0.263484 -4.169795 -2.437675
H  2.993711 -2.751585 0.710362
H  -3.72874 -2.435007 0.400756
H  -3.424106 -1.858705 2.036802
H  -1.199668 0.061485 1.663057
H  -4.677155 -0.603188 -0.762528
H  -4.531178 1.722908 -1.572803
H  -2.717414 3.20114 -0.826988
H  1.051554 4.06291 0.136742
H  -2.79054 3.811073 2.025824
H  1.051381 6.510096 0.474066
H  -2.794987 6.24823 2.333591
H  -0.879139 7.615894 1.565384
elementType: Cl O C H
totalener: -1958.44956688 hartree
nucrepener: 2500.25681191 hartree
electener: -4458.70637879 hartree
oneelecener: -7654.94964012 hartree
twoeener: 3196.24326134 hartree
cpcmener: -0.02659293 hartree
kineticenergy: 1952.57026779 hartree
xcener: -143.508374309257 hartree
chargesum: 0.0000000
charge: -0.055647 -0.061631 -0.291569 -0.457016 -0.327179 0.095026 0.018582 -0.061161 -0.270591 -0.269201 -0.200706 0.380977 0.043822 0.107555 0.045575 -0.296084 -0.222470 0.293020 -0.127442 -0.211387 0.283039 -0.242078 -0.194018 -0.125685 -0.145832 -0.181831 0.082082 0.093320 0.101685 0.091219 0.097846 0.095697 0.098291 0.095623 0.127133 0.114120 0.120988 0.126224 0.141029 0.158041 0.155672 0.143478 0.157452 0.157806 0.158264 0.157962
qa: -0.0556 -0.0616 -0.2916 -0.4570 -0.3272 0.0950 0.0186 -0.0612 -0.2706 -0.2692 -0.2007 0.3810 0.0438 0.1076 0.0456 -0.2961 -0.2225 0.2930 -0.1274 -0.2114 0.2830 -0.2421 -0.1940 -0.1257 -0.1458 -0.1818 0.0821 0.0933 0.1017 0.0912 0.0978 0.0957 0.0983 0.0956 0.1271 0.1141 0.1210 0.1262 0.1410 0.1580 0.1557 0.1435 0.1575 0.1578 0.1583 0.1580
va: 1.2701 1.2431 2.1163 2.0503 2.0751 3.7427 3.8774 3.8154 3.9112 3.8988 3.9051 4.1833 4.2110 3.7903 3.6307 4.0579 3.9720 3.7325 3.8991 3.9232 3.6889 4.0068 3.9109 3.8879 3.8893 3.9009 1.0477 1.0345 1.0005 1.0056 1.0012 1.0001 0.9995 1.0209 1.0204 1.0079 0.9918 1.0318 1.0036 0.9906 0.9969 1.0093 0.9968 0.9891 0.9906 0.9904
dispcorr: -0.021826490 hartree
energy: -1958.471393372369
dipole: -23.07903 22.33910 -0.73994 -9.43413 8.77323 -0.66090 4.93720 -3.90471 1.03249
magnitude: 1.43190 au
magnitude: 3.63959 debye
