program: Orca
programVersion: 5.0.3
elementType: Cl Cl O O O C C C C C C C C C C C C C C C C C C C C C H H H H H H H H H H H H H H H H H H H H
charge: 0
multiplicity: 1
keywords: wb97x-d3
keywords: def2-TZVPP
keywords: def2/J RIJCOSX
keywords: DEFGRID2
keywords: scfconv7
keywords: smallprint printgap noloewdin
keywords: NOSOSCF
formula: C21H20Cl2O3
InChI: InChI=1/C21H20Cl2O3/c1-21(2)17(12-18(22)23)19(21)20(24)25-13-14-7-6-10-16(11-14)26-15-8-4-3-5-9-15/h3-12,17,19H,13H2,1-2H3
46 atoms
Cl 2.143342 -4.195086 -3.218165
Cl 4.876632 -4.293923 -2.300373
O  -0.155954 -0.115366 -1.449481
O  0.782284 1.324155 -0.020773
O  -3.449015 3.23317 1.82243
C  1.140941 -2.132244 0.581494
C  1.69897 -2.211778 -0.815594
C  1.629494 -0.876174 -0.109289
C  1.962056 -2.616612 1.751877
C  -0.336753 -2.383452 0.758765
C  3.018092 -2.798608 -1.082686
C  0.719841 0.221205 -0.511203
C  3.298686 -3.641316 -2.068372
C  -1.158044 0.845155 -1.818938
C  -2.223184 0.940757 -0.764994
C  -2.331546 2.079093 0.022079
C  -3.085004 -0.132314 -0.552675
C  -3.279589 2.128482 1.036883
C  -4.036158 -0.066881 0.452503
C  -4.131559 1.057294 1.260283
C  -2.370246 3.953392 2.256044
C  -2.545432 5.325473 2.375399
C  -1.167722 3.358973 2.62288
C  -1.509913 6.107824 2.865045
C  -0.137172 4.156831 3.099443
C  -0.299539 5.530107 3.2230
H  0.955654 -2.373919 -1.586904
H  2.566082 -0.491211 0.279699
H  1.587026 -2.180136 2.679439
H  1.891651 -3.702186 1.845588
H  3.016797 -2.355435 1.675241
H  -0.499299 -3.427466 1.033586
H  -0.744588 -1.765828 1.561761
H  -0.917353 -2.194491 -0.141347
H  3.837567 -2.528648 -0.427024
H  -0.703389 1.815604 -2.021852
H  -1.565825 0.462457 -2.753388
H  -1.670471 2.918113 -0.156321
H  -3.01326 -1.017556 -1.172755
H  -4.705627 -0.900633 0.619691
H  -4.866849 1.107172 2.053628
H  -3.488626 5.774427 2.089415
H  -1.026125 2.288323 2.543498
H  -1.650937 7.177212 2.957146
H  0.799282 3.693359 3.382948
H  0.508909 6.143504 3.598375
elementType: Cl O C H
totalener: -1958.44771461 hartree
nucrepener: 2492.12203620 hartree
electener: -4450.56975081 hartree
oneelecener: -7637.91527701 hartree
twoeener: 3187.34552620 hartree
cpcmener: -0.02581570 hartree
kineticenergy: 1952.56819169 hartree
xcener: -143.507567077072 hartree
chargesum: -0.0000000
charge: -0.057605 -0.061303 -0.271847 -0.462679 -0.330096 0.095231 0.053756 -0.098787 -0.268327 -0.275938 -0.224000 0.410080 0.044588 0.056067 0.038584 -0.182171 -0.289777 0.281591 -0.097222 -0.249481 0.300740 -0.257622 -0.199585 -0.117832 -0.140152 -0.191572 0.081743 0.098343 0.099200 0.099285 0.089819 0.101365 0.104117 0.087322 0.130093 0.116715 0.125348 0.140462 0.149357 0.156985 0.145840 0.144789 0.151719 0.156794 0.158535 0.157525
qa: -0.0576 -0.0613 -0.2718 -0.4627 -0.3301 0.0952 0.0538 -0.0988 -0.2683 -0.2759 -0.2240 0.4101 0.0446 0.0561 0.0386 -0.1822 -0.2898 0.2816 -0.0972 -0.2495 0.3007 -0.2576 -0.1996 -0.1178 -0.1402 -0.1916 0.0817 0.0983 0.0992 0.0993 0.0898 0.1014 0.1041 0.0873 0.1301 0.1167 0.1253 0.1405 0.1494 0.1570 0.1458 0.1448 0.1517 0.1568 0.1585 0.1575
va: 1.2683 1.2439 2.1273 2.0353 2.0799 3.7187 3.8255 3.8421 3.9078 3.9099 3.8908 4.2031 4.2095 3.8352 3.5670 3.9106 3.9579 3.7277 3.8718 4.0287 3.6839 4.0110 3.8964 3.8819 3.8947 3.9122 1.0434 1.0299 1.0005 1.0011 1.0058 1.0020 0.9983 1.0124 1.0185 1.0078 0.9948 1.0162 1.0004 0.9889 1.0062 1.0088 1.0060 0.9893 0.9911 0.9907
dispcorr: -0.023914237 hartree
energy: -1958.471628846930
dipole: -19.05130 18.74595 -0.30535 19.17578 -19.72525 -0.54947 24.21870 -23.92339 0.29531
magnitude: 0.69453 au
magnitude: 1.76535 debye
