program: Orca
programVersion: 5.0.3
elementType: Cl Cl O O O C C C C C C C C C C C C C C C C C C C C C H H H H H H H H H H H H H H H H H H H H
charge: 0
multiplicity: 1
keywords: wb97x-d3
keywords: def2-TZVPP
keywords: def2/J RIJCOSX
keywords: DEFGRID2
keywords: scfconv7
keywords: smallprint printgap noloewdin
keywords: NOSOSCF
formula: C21H20Cl2O3
InChI: InChI=1/C21H20Cl2O3/c1-21(2)17(12-18(22)23)19(21)20(24)25-13-14-7-6-10-16(11-14)26-15-8-4-3-5-9-15/h3-12,17,19H,13H2,1-2H3
46 atoms
Cl 5.082668 -2.454953 -1.042586
Cl 4.942395 -5.261402 -0.386971
O  -0.764294 -1.36368 1.292581
O  0.607807 -0.075515 0.086962
O  -3.006866 3.759882 -0.473158
C  0.66416 -2.639713 -1.732543
C  1.929365 -2.56483 -0.924019
C  0.585801 -2.451646 -0.231669
C  0.184509 -3.971774 -2.257587
C  0.362382 -1.497297 -2.671412
C  2.747854 -3.755007 -0.665467
C  0.17457 -1.166064 0.369234
C  4.07331 -3.80597 -0.695004
C  -1.353887 -0.213366 1.905976
C  -2.326579 0.464126 0.982557
C  -2.188632 1.814073 0.692513
C  -3.375403 -0.260952 0.421113
C  -3.114618 2.440607 -0.134702
C  -4.275569 0.368515 -0.422832
C  -4.157858 1.723578 -0.699701
C  -2.577573 4.663436 0.462127
C  -1.632022 5.596622 0.065159
C  -3.102741 4.686891 1.748523
C  -1.206954 6.561931 0.967503
C  -2.6609 5.650415 2.642644
C  -1.711883 6.588924 2.259326
H  2.470306 -1.630429 -1.022022
H  0.255751 -3.326405 0.317437
H  0.28655 -4.781346 -1.53577
H  -0.871719 -3.909308 -2.52548
H  0.736908 -4.252226 -3.156426
H  0.831735 -0.560838 -2.379583
H  0.725565 -1.744563 -3.670579
H  -0.713624 -1.328138 -2.746202
H  2.23467 -4.679057 -0.426683
H  -1.870056 -0.60745 2.781354
H  -0.587312 0.479663 2.25693
H  -1.35845 2.370539 1.111397
H  -3.492552 -1.314215 0.644901
H  -5.091178 -0.193793 -0.858708
H  -4.868201 2.220459 -1.348491
H  -1.234155 5.567218 -0.941324
H  -3.851007 3.965886 2.053424
H  -0.468924 7.290128 0.657373
H  -3.068435 5.66804 3.645091
H  -1.371623 7.337645 2.962535
elementType: Cl O C H
totalener: -1958.45011439 hartree
nucrepener: 2425.58851739 hartree
electener: -4384.03863178 hartree
oneelecener: -7505.19134372 hartree
twoeener: 3121.15271195 hartree
cpcmener: -0.02600488 hartree
kineticenergy: 1952.57689531 hartree
xcener: -143.507829062770 hartree
chargesum: -0.0000000
charge: -0.056498 -0.061281 -0.284404 -0.460154 -0.331314 0.089988 0.028597 -0.077288 -0.267857 -0.267791 -0.201348 0.392102 0.037879 0.091838 0.010734 -0.156330 -0.252058 0.242758 -0.114653 -0.243017 0.257068 -0.234341 -0.173438 -0.127491 -0.148898 -0.178391 0.080104 0.094136 0.090722 0.098238 0.101358 0.095222 0.097432 0.098962 0.128309 0.126030 0.113571 0.140554 0.140838 0.157396 0.147184 0.146417 0.155540 0.156941 0.158952 0.157680
qa: -0.0565 -0.0613 -0.2844 -0.4602 -0.3313 0.0900 0.0286 -0.0773 -0.2679 -0.2678 -0.2013 0.3921 0.0379 0.0918 0.0107 -0.1563 -0.2521 0.2428 -0.1147 -0.2430 0.2571 -0.2343 -0.1734 -0.1275 -0.1489 -0.1784 0.0801 0.0941 0.0907 0.0982 0.1014 0.0952 0.0974 0.0990 0.1283 0.1260 0.1136 0.1406 0.1408 0.1574 0.1472 0.1464 0.1555 0.1569 0.1590 0.1577
va: 1.2692 1.2437 2.1242 2.0519 2.0692 3.7255 3.8739 3.8269 3.9084 3.9048 3.8926 4.2047 4.2118 3.8047 3.6310 3.8884 3.9624 3.7439 3.8949 4.0150 3.7183 4.0027 3.9044 3.8873 3.8946 3.8990 1.0474 1.0343 1.0054 1.0014 1.0005 1.0195 1.0003 0.9997 1.0189 0.9915 1.0104 1.0123 1.0098 0.9889 1.0060 1.0072 0.9970 0.9895 0.9903 0.9905
dispcorr: -0.021822976 hartree
energy: -1958.471937361592
dipole: -33.80121 32.29481 -1.50641 17.00281 -17.73377 -0.73096 -1.35598 1.95501 0.59903
magnitude: 1.77832 au
magnitude: 4.52012 debye
