program: Orca
programVersion: 5.0.3
elementType: Cl Cl O O O C C C C C C C C C C C C C C C C C C C C C H H H H H H H H H H H H H H H H H H H H
charge: 0
multiplicity: 1
keywords: wb97x-d3
keywords: def2-TZVPP
keywords: def2/J RIJCOSX
keywords: DEFGRID2
keywords: scfconv7
keywords: smallprint printgap noloewdin
keywords: NOSOSCF
formula: C21H20Cl2O3
InChI: InChI=1/C21H20Cl2O3/c1-21(2)17(12-18(22)23)19(21)20(24)25-13-14-7-6-10-16(11-14)26-15-8-4-3-5-9-15/h3-12,17,19H,13H2,1-2H3
46 atoms
Cl -0.016088 -1.37898 1.976202
Cl 1.510004 -3.201211 3.625551
O  -1.146088 -1.561994 -1.936876
O  0.505168 -0.052535 -1.884397
O  -1.939357 3.628439 0.391229
C  2.337525 -2.585139 -1.509966
C  2.043069 -1.930611 -0.204283
C  0.898987 -2.287644 -1.128757
C  2.709013 -4.049271 -1.518059
C  3.039497 -1.786286 -2.580009
C  2.177996 -2.623475 1.094872
C  0.107322 -1.172013 -1.691928
C  1.33551 -2.428502 2.101531
C  -2.098563 -0.535701 -2.22384
C  -2.398144 0.260191 -0.985152
C  -2.047481 1.599631 -0.9152
C  -2.974209 -0.364532 0.116206
C  -2.249828 2.309546 0.262173
C  -3.191208 0.355158 1.279199
C  -2.822594 1.688921 1.36268
C  -0.856625 4.162956 -0.245643
C  0.334424 3.468956 -0.424368
C  -0.975361 5.478118 -0.673469
C  1.397701 4.101753 -1.049439
C  0.101308 6.100589 -1.28446
C  1.290484 5.415042 -1.481806
H  2.249176 -0.863592 -0.168661
H  0.310641 -3.154356 -0.850511
H  3.780777 -4.175471 -1.351591
H  2.183843 -4.620644 -0.75218
H  2.471103 -4.497831 -2.483511
H  2.822225 -2.192101 -3.56943
H  2.755556 -0.737086 -2.578479
H  4.119073 -1.842027 -2.43091
H  3.011908 -3.296641 1.254875
H  -1.749226 0.10753 -3.033612
H  -2.981231 -1.071807 -2.571873
H  -1.587415 2.075736 -1.771467
H  -3.24396 -1.411984 0.068378
H  -3.640245 -0.126723 2.137529
H  -2.974464 2.252191 2.273984
H  0.436671 2.442383 -0.097575
H  -1.908678 6.004563 -0.522414
H  2.319581 3.554888 -1.196276
H  0.003457 7.126177 -1.615194
H  2.126312 5.899506 -1.967831
totalener: -1958.42425822 hartree
nucrepener: 2617.64947522 hartree
electener: -4576.07373344 hartree
oneelecener: -7888.88154335 hartree
twoeener: 3312.80780991 hartree
kineticenergy: 1952.63169103 hartree
xcener: -143.516794955662 hartree
chargesum: -0.0000000
charge: -0.033463 -0.044958 -0.261403 -0.399532 -0.298961 0.127155 -0.040662 -0.107800 -0.274138 -0.253263 -0.244039 0.351914 0.098938 0.060734 0.047428 -0.169183 -0.263780 0.266731 -0.085823 -0.208647 0.278357 -0.173516 -0.228079 -0.107094 -0.084713 -0.151588 0.110584 0.096927 0.093956 0.085396 0.094906 0.085348 0.102988 0.084831 0.118597 0.101067 0.115158 0.123751 0.113131 0.128505 0.125135 0.127241 0.122178 0.124487 0.123043 0.122158
qa: -0.0335 -0.0450 -0.2614 -0.3995 -0.2990 0.1272 -0.0407 -0.1078 -0.2741 -0.2533 -0.2440 0.3519 0.0989 0.0607 0.0474 -0.1692 -0.2638 0.2667 -0.0858 -0.2086 0.2784 -0.1735 -0.2281 -0.1071 -0.0847 -0.1516 0.1106 0.0969 0.0940 0.0854 0.0949 0.0853 0.1030 0.0848 0.1186 0.1011 0.1152 0.1238 0.1131 0.1285 0.1251 0.1272 0.1222 0.1245 0.1230 0.1222
va: 1.3163 1.2619 2.1268 2.0907 2.1182 3.7267 3.8594 3.8445 3.9107 3.8956 3.9075 4.1939 4.2026 3.8556 3.6021 3.9248 3.9904 3.8302 3.8636 4.0386 3.7827 3.9355 4.0442 3.9449 3.9275 3.9648 1.0248 1.0272 1.0005 1.0010 1.0065 1.0028 1.0226 1.0019 1.0158 1.0113 0.9906 1.0165 1.0190 0.9981 1.0124 1.0156 1.0155 1.0001 0.9990 1.0009
dispcorr: -0.025435711 hartree
energy: -1958.449693933540
dipole: 7.80588 -7.47596 0.32992 5.34946 -6.14709 -0.79763 -26.73393 26.12624 -0.60769
magnitude: 1.05563 au
magnitude: 2.68319 debye
