program: Gaussian 09
title: 000007766
version: EM64L-G09RevD.01
frameworkgroup: C1[X(C5H10O3)]
method: RPBEPBE
basis: SDD
operation: Freq
keyword: #pfreq=noraman
keyword: PBEPBE/SDD
title: #p freq=noraman PBEPBE/SDD
converged: YES YES NO YES
title: Mulliken charges:
elementType: O O O C C C C C H H H H H H H H H H
charge: -0.242445 -0.242445 -0.282230 -0.243946 -0.243946 -0.669672 -0.669672 0.317911 0.230038 0.230046 0.230045 0.230037 0.211024 0.233558 0.233558 0.211024 0.233557 0.233558
chargesum: 0.00000
title: Mulliken charges with hydrogens summed into heavy atoms:
elementType: O O O C C C C C
charge: -0.242445 -0.242445 -0.282230 0.216138 0.216136 0.008468 0.008467 0.317911
polarizability: 9.08296302e+01 -8.64431031e-06 6.05563430e+01 2.12308777e-04 3.93093097e-03 4.82572554e+01
1716.lowfreq: -29.0714 -12.4223 -4.7906 -0.0011 -0.0008 -0.0007 25.3049 44.9248 97.4852
frequency: 23.1629 43.1786 97.3229 114.0667 156.2451 235.1679 245.9512 252.0211 328.5274 361.9977 465.6706 675.6864 700.8815 799.0950 800.2221 813.2315 837.3723 976.8570 1021.1906 1063.2021 1111.1433 1117.2205 1136.0953 1139.7470 1188.5813 1250.4609 1252.7907 1353.3530 1368.9532 1400.9309 1401.9460 1461.3367 1461.4804 1473.8055 1474.5213 1487.0728 1487.6351 1618.7426 2998.5843 2998.6904 3009.8940 3010.4029 3069.5694 3070.0815 3095.2851 3095.4281 3111.4884 3111.7593
redmass: 1.8566 3.9662 2.1902 3.4808 2.7657 4.2095 1.1711 1.3229 3.4407 3.9393 4.1202 7.7591 11.0048 1.0931 1.1023 3.6544 3.9733 3.1749 2.3015 4.7381 2.2986 2.2438 1.4586 1.4710 5.1448 1.1333 1.1258 1.3256 1.4123 1.2603 1.2914 1.0399 1.0400 1.0577 1.0565 1.0732 1.0723 10.1332 1.0360 1.0360 1.0579 1.0581 1.1071 1.1072 1.0984 1.0984 1.1025 1.1026
irintensity: 0.0000 0.2815 10.2295 3.2681 0.0000 6.8081 0.8962 0.0000 0.2015 24.5344 0.4430 6.1973 21.6046 0.0000 7.2258 33.3465 6.5252 9.3080 150.5453 0.1498 29.7601 6.0276 0.0000 11.4010 898.3375 0.0000 0.0000 6.7067 13.0981 22.2382 18.3407 0.0001 24.0237 9.2458 0.1878 33.2406 1.4414 245.5256 23.6677 13.9861 14.4879 28.2221 0.0002 20.9853 22.6626 34.8196 0.0028 85.7509
temp: 298.150 k
press: 1.00000 atm
elementType: 8 8 8 6 6 6 6 6 1 1 1 1 1 1 1 1 1 1
symmnumber: 1
zpe: 387399.0 jmol-1
zpe.correction: 0.147552 hartree
zpe.thermalcorrener: 0.157516 hartree
zpe.thermalcorrenthalpy: 0.158460 hartree
zpe.thermalcorrgfe: 0.110746 hartree
zpe.sumelectzpe: -421.541730 hartree
zpe.sumelectthermal: -421.531766 hartree
zpe.sumelectthermalent: -421.530822 hartree
zpe.sumelectthermalfe: -421.578537 hartree
dipole: 0.0000 -0.2015 0.0008
dipole: 0.2015
quadrupole: -32.9759 -55.2086 -46.8662
quadrupole: 0.0000 0.0000 -0.0032
quadrupole: 12.0410 -10.1917 -1.8493 0.0000 0.0000 -0.0032
hfenergy: -421.6892827 hartree
pointgroup: C01 [X(C5H10O3)]
dipole: -0.0000103 -0.0792626 -0.0003253 debye
dipolederiv: -1.7784346 -0.2428485 -0.0000659 -0.4273045 -0.5401374 0.0001232 -0.0004958 -0.0000475 -0.2857047 -1.7784449 0.2428372 0.0000514 0.4272892 -0.5401326 0.0001266 0.0004801 -0.0000448 -0.2857056 -0.7483524 0.0000008 -0.0000019 0.0000014 -0.9987231 -0.0001029 -0.0000019 0.0005598 -0.3302093 1.0242328 0.0258361 0.0001603 -0.1878417 0.2422436 -0.0000028 0.0002246 0.0000508 0.359801 1.0242319 -0.0258266 -0.000155 0.1878528 0.2422456 -0.0000009 -0.0002173 0.0000497 0.3598031 -0.1112911 -0.0874965 -0.0000071 -0.0704461 -0.0031311 -0.0000177 -0.0000297 -0.00001 0.0570898 -0.1112915 0.0874947 0.0000027 0.070444 -0.0031274 -0.0000141 0.0000251 -0.0000064 0.0570911 2.481107 0.0000034 0.0000099 0.0000078 1.5011642 -0.0000561 0.0000086 -0.0004388 0.3274206 -0.0449277 -0.0233171 -0.0240622 0.0651054 -0.0034998 -0.0920796 0.0136611 -0.1071977 -0.0632042 -0.0449933 -0.0233968 0.0241206 0.0650018 -0.0033477 0.0920602 -0.0136546 0.1071237 -0.0633305 -0.0449953 0.0233935 -0.0241199 -0.0650044 -0.0033446 0.0920597 0.0136571 0.1071251 -0.063338 -0.0449267 0.0233185 0.0240628 -0.0651054 -0.0035049 -0.0920821 -0.0136601 -0.1071988 -0.0631997 -0.1338081 0.072827 -0.0001102 0.0969882 0.0349017 0.0000698 -0.0001322 0.000059 0.1176233 0.1114122 0.0149462 0.0308244 -0.037872 0.0107939 -0.102291 0.0044899 -0.1168576 -0.0603454 0.1114389 0.0148359 -0.0307166 -0.0379548 0.0109539 0.1022153 -0.0043289 0.1168179 -0.0605338 -0.133807 -0.0728285 0.0001077 -0.0969908 0.0348993 0.00007 0.0001303 0.0000599 0.1176229 0.1114379 -0.0148361 0.0307188 0.0379539 0.0109584 0.1022151 0.0043296 0.1168163 -0.060538 0.1114119 -0.0149432 -0.0308197 0.0378752 0.010788 -0.1022929 -0.0044858 -0.1168606 -0.0603427 unknown
polarizability: 90.8296302|0.000121|60.556343|0.0002123|-0.0039309|48.2572554 unknown
InChI: InChI=1S/C5H10O3/c1-3-7-5(6)8-4-2/h3-4H2,1-2H3
charge 0 multiplicity 1
18 atoms
O  -1.116086 -0.466974 0.000403
O  1.116067 -0.466963 0.000413
O  -0.000019 1.602197 -0.000396
C  -2.42222 0.264188 -0.000391
C  2.422191 0.264204 -0.000374
C  -3.512394 -0.800537 -0.000413
C  3.512376 -0.80051 -0.000351
C  -0.000014 0.348144 0.000591
H  -2.46016 0.911013 0.894788
H  -2.459482 0.910351 -0.896076
H  2.459469 0.910346 -0.896073
H  2.460115 0.911053 0.894789
H  -4.505839 -0.316252 -0.000961
H  -3.436696 -1.441601 -0.894819
H  -3.437365 -1.440947 0.894518
H  4.505816 -0.316214 -0.000894
H  3.437337 -1.440902 0.894592
H  3.436704 -1.441595 -0.894745
