program: Orca
programVersion: 5.0.3
elementType: Cl Cl O O O C C C C C C C C C C C C C C C C C C C C C H H H H H H H H H H H H H H H H H H H H
charge: 0
multiplicity: 1
keywords: wb97x-d3
keywords: def2-TZVPP
keywords: def2/J RIJCOSX
keywords: DEFGRID2
keywords: scfconv7
keywords: smallprint printgap noloewdin
keywords: NOSOSCF
formula: C21H20Cl2O3
InChI: InChI=1/C21H20Cl2O3/c1-21(2)17(12-18(22)23)19(21)20(24)25-13-14-7-6-10-16(11-14)26-15-8-4-3-5-9-15/h3-12,17,19H,13H2,1-2H3
46 atoms
Cl 2.000432 0.336429 -2.501225
Cl 4.227201 0.990217 -0.789189
O  -1.571637 -2.09209 -0.381553
O  -1.783193 -1.872147 1.835343
O  -2.049257 2.903713 -0.445886
C  1.251608 -3.143238 0.3428
C  1.278391 -1.772318 -0.273743
C  0.392532 -2.044401 0.92766
C  2.403679 -3.605893 1.204033
C  0.644723 -4.267653 -0.460702
C  2.433772 -0.878029 -0.135917
C  -1.088911 -1.995985 0.865595
C  2.824435 0.022856 -1.028108
C  -2.970269 -1.923206 -0.553693
C  -3.406397 -0.490499 -0.398758
C  -2.500126 0.549746 -0.52751
C  -4.744872 -0.208031 -0.151207
C  -2.923424 1.861995 -0.358349
C  -5.165826 1.106277 -0.034902
C  -4.258131 2.150628 -0.122711
C  -0.810944 2.768182 0.118585
C  0.274765 3.261501 -0.58755
C  -0.63515 2.193214 1.372365
C  1.543599 3.182584 -0.034365
C  0.639908 2.113496 1.908989
C  1.733957 2.604161 1.210987
H  0.752694 -1.693892 -1.217146
H  0.745342 -1.657804 1.877127
H  2.78989 -2.826125 1.859147
H  2.086011 -4.43037 1.843786
H  3.229845 -3.962261 0.586584
H  1.42402 -4.760277 -1.043927
H  0.200849 -5.017843 0.196155
H  -0.121069 -3.932574 -1.154738
H  3.033339 -0.951782 0.762518
H  -3.168377 -2.272129 -1.568446
H  -3.527339 -2.56237 0.135439
H  -1.456908 0.353683 -0.741552
H  -5.458013 -1.015321 -0.037664
H  -6.208389 1.322361 0.156665
H  -4.573969 3.177989 -0.00006
H  0.122277 3.701587 -1.563977
H  -1.482172 1.806654 1.924401
H  2.390401 3.560455 -0.590855
H  0.773242 1.666479 2.885585
H  2.727689 2.53421 1.631703
totalener: -1958.42269110 hartree
nucrepener: 2704.73659433 hartree
electener: -4663.15928543 hartree
oneelecener: -8062.67899569 hartree
twoeener: 3399.51971026 hartree
kineticenergy: 1952.62903975 hartree
xcener: -143.521043919867 hartree
chargesum: -0.0000000
charge: -0.050268 -0.059399 -0.287205 -0.337713 -0.302222 0.065795 0.094999 -0.053284 -0.264422 -0.249615 -0.247363 0.293251 0.094101 0.032262 0.092375 -0.181871 -0.209502 0.223650 -0.081291 -0.212591 0.263516 -0.221171 -0.155994 -0.101085 -0.135448 -0.143673 0.080899 0.078783 0.075153 0.096021 0.099877 0.089605 0.093516 0.089901 0.092387 0.107639 0.109406 0.123000 0.104963 0.123135 0.125279 0.122567 0.136948 0.130318 0.127988 0.126784
qa: -0.0503 -0.0594 -0.2872 -0.3377 -0.3022 0.0658 0.0950 -0.0533 -0.2644 -0.2496 -0.2474 0.2933 0.0941 0.0323 0.0924 -0.1819 -0.2095 0.2236 -0.0813 -0.2126 0.2635 -0.2212 -0.1560 -0.1011 -0.1354 -0.1437 0.0809 0.0788 0.0752 0.0960 0.0999 0.0896 0.0935 0.0899 0.0924 0.1076 0.1094 0.1230 0.1050 0.1231 0.1253 0.1226 0.1369 0.1303 0.1280 0.1268
va: 1.2750 1.2476 2.0855 2.1649 2.1112 3.8099 3.7091 3.7970 3.9210 3.9112 3.9415 4.2798 4.2242 3.8706 3.6440 3.9418 4.0467 3.8500 3.9443 4.0485 3.7688 4.0282 3.8996 3.8465 3.9128 3.8562 1.0474 1.0332 1.0100 1.0034 1.0011 1.0022 1.0016 1.0184 1.0352 0.9877 1.0076 1.0118 1.0103 0.9992 1.0122 1.0146 1.0054 1.0069 0.9998 1.0064
dispcorr: -0.028787596 hartree
energy: -1958.451478693358
dipole: -12.62825 12.78406 0.15581 -18.97680 17.93084 -1.04596 12.27535 -12.40056 -0.12521
magnitude: 1.06489 au
magnitude: 2.70673 debye
