program: Orca
programVersion: 5.0.3
elementType: Cl Cl O O O C C C C C C C C C C C C C C C C C C C C C H H H H H H H H H H H H H H H H H H H H
charge: 0
multiplicity: 1
keywords: wb97x-d3
keywords: def2-TZVPP
keywords: def2/J RIJCOSX
keywords: DEFGRID2
keywords: scfconv7
keywords: smallprint printgap noloewdin
keywords: NOSOSCF
formula: C21H20Cl2O3
InChI: InChI=1/C21H20Cl2O3/c1-21(2)17(12-18(22)23)19(21)20(24)25-13-14-7-6-10-16(11-14)26-15-8-4-3-5-9-15/h3-12,17,19H,13H2,1-2H3
46 atoms
Cl 3.36463 -4.27654 1.237522
Cl 4.724505 -4.782035 -1.256112
O  -1.65104 -1.420636 -1.662326
O  -1.058679 -1.873976 0.448354
O  -2.123347 3.458713 -0.566171
C  1.636766 -0.638893 -0.678699
C  1.76706 -2.110895 -0.398949
C  0.617639 -1.609809 -1.240222
C  2.554076 0.018617 -1.681949
C  1.275418 0.269513 0.471635
C  2.807349 -2.933675 -1.028971
C  -0.757968 -1.6661 -0.694518
C  3.526796 -3.870234 -0.423137
C  -3.005739 -1.271584 -1.257365
C  -3.242921 0.008252 -0.502976
C  -2.561067 1.168963 -0.849952
C  -4.165015 0.04287 0.533062
C  -2.800394 2.345744 -0.159377
C  -4.412721 1.230151 1.205537
C  -3.734375 2.388937 0.868878
C  -1.564457 4.286524 0.362652
C  -1.55978 5.644747 0.07724
C  -0.973226 3.809942 1.527007
C  -0.962833 6.528454 0.962451
C  -0.387133 4.707323 2.406746
C  -0.379162 6.0670 2.133038
H  1.487514 -2.404555 0.606359
H  0.681503 -1.769903 -2.311153
H  2.750507 -0.600927 -2.556227
H  2.114269 0.950828 -2.039467
H  3.515048 0.258335 -1.22411
H  0.738937 1.150986 0.113346
H  0.657046 -0.218835 1.220765
H  2.185211 0.616089 0.964382
H  3.013107 -2.779434 -2.081083
H  -3.572575 -1.27444 -2.189685
H  -3.33235 -2.128521 -0.663726
H  -1.833484 1.171722 -1.652062
H  -4.682672 -0.861562 0.826498
H  -5.135624 1.25239 2.010115
H  -3.925492 3.31212 1.400418
H  -2.020946 5.998539 -0.835484
H  -0.968127 2.750256 1.748816
H  -0.962489 7.586573 0.736379
H  0.072059 4.334304 3.312792
H  0.079953 6.760126 2.824568
totalener: -1958.42589256 hartree
nucrepener: 2485.69791083 hartree
electener: -4444.12380340 hartree
oneelecener: -7624.44741633 hartree
twoeener: 3180.32361293 hartree
kineticenergy: 1952.61854935 hartree
xcener: -143.514234943935 hartree
chargesum: 0.0000000
charge: -0.040878 -0.049341 -0.273036 -0.360957 -0.301698 0.072614 0.046507 -0.066112 -0.245700 -0.250986 -0.205070 0.307059 0.049205 0.064959 0.086413 -0.289597 -0.166064 0.239012 -0.101052 -0.162560 0.255649 -0.210806 -0.165418 -0.092207 -0.133851 -0.143148 0.084310 0.077360 0.071950 0.094896 0.099030 0.078012 0.104248 0.095054 0.095521 0.108069 0.105011 0.122191 0.105692 0.126867 0.133606 0.124514 0.133339 0.125040 0.126803 0.125551
qa: -0.0409 -0.0493 -0.2730 -0.3610 -0.3017 0.0726 0.0465 -0.0661 -0.2457 -0.2510 -0.2051 0.3071 0.0492 0.0650 0.0864 -0.2896 -0.1661 0.2390 -0.1011 -0.1626 0.2556 -0.2108 -0.1654 -0.0922 -0.1339 -0.1431 0.0843 0.0774 0.0719 0.0949 0.0990 0.0780 0.1042 0.0951 0.0955 0.1081 0.1050 0.1222 0.1057 0.1269 0.1336 0.1245 0.1333 0.1250 0.1268 0.1256
va: 1.2867 1.2557 2.1177 2.1406 2.0936 3.7715 3.8418 3.8270 3.9045 3.9083 3.9213 4.2961 4.2463 3.8569 3.6430 4.0342 4.0349 3.8310 3.9533 3.9661 3.7835 4.0368 3.9106 3.9391 3.9775 3.9597 1.0521 1.0353 1.0095 1.0044 1.0032 1.0032 1.0190 1.0040 1.0307 0.9879 1.0097 1.0305 1.0126 1.0004 1.0026 1.0145 1.0034 0.9987 1.0005 1.0002
dispcorr: -0.023444213 hartree
energy: -1958.449336776822
dipole: -19.67581 19.23804 -0.43777 34.81488 -33.95729 0.85758 0.58115 -0.92488 -0.34373
magnitude: 1.02237 au
magnitude: 2.59867 debye
