program: Orca
programVersion: 5.0.3
elementType: Cl Cl O O O C C C C C C C C C C C C C C C C C C C C C H H H H H H H H H H H H H H H H H H H H
charge: 0
multiplicity: 1
keywords: wb97x-d3
keywords: def2-TZVPP
keywords: def2/J RIJCOSX
keywords: DEFGRID2
keywords: scfconv7
keywords: smallprint printgap noloewdin
keywords: NOSOSCF
formula: C21H20Cl2O3
InChI: InChI=1/C21H20Cl2O3/c1-21(2)17(12-18(22)23)19(21)20(24)25-13-14-7-6-10-16(11-14)26-15-8-4-3-5-9-15/h3-12,17,19H,13H2,1-2H3
46 atoms
Cl 3.412547 -3.970953 1.485028
Cl 4.68934 -4.805202 -0.964747
O  -1.688328 -1.463703 -1.625287
O  -1.053963 -1.752648 0.501493
O  -2.396371 3.437874 -0.614443
C  1.622879 -0.609968 -0.789581
C  1.749855 -2.047131 -0.365067
C  0.5900 -1.624723 -1.234024
C  2.5282 -0.064634 -1.868139
C  1.286034 0.410352 0.270933
C  2.774462 -2.940908 -0.919253
C  -0.77574 -1.630488 -0.659352
C  3.518859 -3.788286 -0.219394
C  -3.044094 -1.352853 -1.210546
C  -3.328743 -0.071021 -0.476772
C  -2.714024 1.11611 -0.859397
C  -4.231075 -0.061574 0.576681
C  -2.998773 2.290319 -0.183541
C  -4.523722 1.123245 1.236076
C  -3.908693 2.306456 0.865917
C  -1.68671 4.194711 0.269637
C  -1.61945 5.557975 0.013142
C  -1.013876 3.649775 1.357294
C  -0.873134 6.375638 0.845694
C  -0.275188 4.483276 2.184426
C  -0.200706 5.84542 1.937587
H  1.483201 -2.233625 0.66886
H  0.634686 -1.89028 -2.284843
H  2.711278 -0.774212 -2.674162
H  2.086629 0.826649 -2.316174
H  3.495644 0.217653 -1.450234
H  0.676306 0.002181 1.073691
H  2.205057 0.795778 0.714923
H  0.750287 1.25823 -0.160977
H  2.94404 -2.925267 -1.988816
H  -3.617229 -1.395997 -2.137952
H  -3.3329 -2.210582 -0.598374
H  -2.003891 1.140177 -1.676798
H  -4.698582 -0.984796 0.894984
H  -5.230395 1.123066 2.055151
H  -4.128677 3.230565 1.3847
H  -2.148289 5.965802 -0.838374
H  -1.059444 2.587476 1.56064
H  -0.824665 7.437147 0.641601
H  0.248733 4.056605 3.02971
H  0.376834 6.487702 2.588326
totalener: -1958.42576938 hartree
nucrepener: 2492.71938161 hartree
electener: -4451.14515099 hartree
oneelecener: -7638.50620703 hartree
twoeener: 3187.36105605 hartree
kineticenergy: 1952.62034387 hartree
xcener: -143.514169440890 hartree
chargesum: -0.0000000
charge: -0.040885 -0.049133 -0.272663 -0.360393 -0.301208 0.078800 0.043615 -0.072667 -0.244149 -0.257912 -0.205486 0.312249 0.050083 0.062586 0.076815 -0.274477 -0.155004 0.222030 -0.104807 -0.148323 0.252177 -0.206329 -0.170282 -0.094889 -0.136759 -0.141666 0.085158 0.077905 0.071609 0.094561 0.098988 0.102236 0.094683 0.083224 0.096060 0.108762 0.104300 0.121671 0.105171 0.126964 0.133686 0.124568 0.134749 0.124379 0.126185 0.123821
qa: -0.0409 -0.0491 -0.2727 -0.3604 -0.3012 0.0788 0.0436 -0.0727 -0.2441 -0.2579 -0.2055 0.3122 0.0501 0.0626 0.0768 -0.2745 -0.1550 0.2220 -0.1048 -0.1483 0.2522 -0.2063 -0.1703 -0.0949 -0.1368 -0.1417 0.0852 0.0779 0.0716 0.0946 0.0990 0.1022 0.0947 0.0832 0.0961 0.1088 0.1043 0.1217 0.1052 0.1270 0.1337 0.1246 0.1347 0.1244 0.1262 0.1238
va: 1.2865 1.2560 2.1186 2.1421 2.0922 3.7701 3.8391 3.8335 3.9039 3.9095 3.9214 4.2886 4.2446 3.8585 3.6391 4.0370 4.0267 3.8476 3.9546 3.9812 3.7863 4.0269 3.8977 3.9449 3.9811 3.9584 1.0523 1.0352 1.0094 1.0047 1.0032 1.0182 1.0048 1.0026 1.0299 0.9879 1.0087 1.0293 1.0124 1.0004 1.0025 1.0144 1.0034 0.9987 1.0007 1.0005
dispcorr: -0.023606588 hartree
energy: -1958.449375964195
dipole: -19.38022 18.95686 -0.42336 33.36077 -32.70547 0.65530 -2.07802 1.63302 -0.44500
magnitude: 0.89815 au
magnitude: 2.28291 debye
