program: Orca
programVersion: 5.0.3
elementType: Cl Cl O O O C C C C C C C C C C C C C C C C C C C C C H H H H H H H H H H H H H H H H H H H H
charge: 0
multiplicity: 1
keywords: wb97x-d3
keywords: def2-TZVPP
keywords: def2/J RIJCOSX
keywords: DEFGRID2
keywords: scfconv7
keywords: smallprint printgap noloewdin
keywords: NOSOSCF
formula: C21H20Cl2O3
InChI: InChI=1/C21H20Cl2O3/c1-21(2)17(12-18(22)23)19(21)20(24)25-13-14-7-6-10-16(11-14)26-15-8-4-3-5-9-15/h3-12,17,19H,13H2,1-2H3
46 atoms
Cl 1.801934 -3.918281 -1.941893
Cl 4.671708 -3.737039 -2.203826
O  -1.203446 -0.940221 -1.160908
O  -0.815817 -1.962082 0.798445
O  -2.984517 2.818158 1.891168
C  1.861668 -0.349198 0.585661
C  2.084214 -1.792531 0.277734
C  0.998514 -1.046223 -0.455523
C  2.834274 0.668908 0.039673
C  1.292506 0.0349 1.929552
C  3.283666 -2.261519 -0.450613
C  -0.413878 -1.384707 -0.177128
C  3.255418 -3.181643 -1.40526
C  -2.612153 -1.108687 -1.03655
C  -3.279055 0.174051 -0.62104
C  -2.792958 0.911245 0.452109
C  -4.410289 0.617919 -1.2955
C  -3.425675 2.087125 0.825838
C  -5.052587 1.780378 -0.895926
C  -4.559424 2.528964 0.159781
C  -1.660795 3.131033 1.985326
C  -0.890299 3.453876 0.873565
C  -1.106937 3.170675 3.257857
C  0.434493 3.823883 1.049188
C  0.217538 3.547343 3.417743
C  0.995993 3.873127 2.316848
H  1.712957 -2.487458 1.027233
H  1.203617 -0.766739 -1.482417
H  3.210254 0.405549 -0.949529
H  2.354159 1.645534 -0.034625
H  3.693053 0.775473 0.705778
H  0.657135 -0.736098 2.357099
H  2.107426 0.21913 2.631483
H  0.713283 0.957035 1.857883
H  4.251797 -1.862272 -0.170956
H  -2.969863 -1.41506 -2.02018
H  -2.841386 -1.908268 -0.329637
H  -1.933477 0.570917 1.016007
H  -4.792426 0.054987 -2.138087
H  -5.934466 2.11783 -1.423864
H  -5.042375 3.445676 0.470754
H  -1.318895 3.426609 -0.119841
H  -1.718193 2.91319 4.112736
H  1.028175 4.085335 0.182734
H  0.643285 3.57861 4.411922
H  2.029547 4.164502 2.445086
totalener: -1958.42453262 hartree
nucrepener: 2578.12495606 hartree
electener: -4536.54948868 hartree
oneelecener: -7809.31715583 hartree
twoeener: 3272.76766715 hartree
kineticenergy: 1952.61415131 hartree
xcener: -143.514828483968 hartree
chargesum: 0.0000000
charge: -0.034395 -0.044458 -0.259456 -0.380050 -0.299237 0.162035 -0.028581 -0.128281 -0.288435 -0.232417 -0.244384 0.328330 0.089121 0.057429 0.013356 -0.137025 -0.183228 0.192435 -0.083401 -0.201031 0.195945 -0.095950 -0.169367 -0.184387 -0.101680 -0.129821 0.109897 0.099212 0.088976 0.092291 0.093196 0.112089 0.088597 0.031418 0.117038 0.094935 0.116966 0.145813 0.108419 0.125785 0.126663 0.129793 0.125965 0.131813 0.124339 0.123727
qa: -0.0344 -0.0445 -0.2595 -0.3800 -0.2992 0.1620 -0.0286 -0.1283 -0.2884 -0.2324 -0.2444 0.3283 0.0891 0.0574 0.0134 -0.1370 -0.1832 0.1924 -0.0834 -0.2010 0.1959 -0.0959 -0.1694 -0.1844 -0.1017 -0.1298 0.1099 0.0992 0.0890 0.0923 0.0932 0.1121 0.0886 0.0314 0.1170 0.0949 0.1170 0.1458 0.1084 0.1258 0.1267 0.1298 0.1260 0.1318 0.1243 0.1237
va: 1.2975 1.2620 2.1288 2.1125 2.1055 3.6533 3.8611 3.8729 3.9144 3.8964 3.9083 4.2295 4.2030 3.8651 3.7961 3.9346 4.0063 3.8630 3.9466 4.0422 3.8647 3.8493 3.9853 3.9233 3.9327 3.8861 1.0266 1.0271 1.0033 1.0155 1.0007 1.0233 1.0080 1.0186 1.0167 0.9992 1.0132 1.0031 1.0126 0.9996 1.0120 1.0070 1.0134 0.9996 0.9996 1.0020
dispcorr: -0.026484588 hartree
energy: -1958.451017206531
dipole: -11.15607 11.32241 0.16635 29.46964 -28.61763 0.85201 16.52638 -16.72990 -0.20352
magnitude: 0.89163 au
magnitude: 2.26634 debye
