program: Orca
programVersion: 5.0.3
elementType: Cl Cl O O O C C C C C C C C C C C C C C C C C C C C C H H H H H H H H H H H H H H H H H H H H
charge: 0
multiplicity: 1
keywords: wb97x-d3
keywords: def2-TZVPP
keywords: def2/J RIJCOSX
keywords: DEFGRID2
keywords: scfconv7
keywords: smallprint printgap noloewdin
keywords: NOSOSCF
formula: C21H20Cl2O3
InChI: InChI=1/C21H20Cl2O3/c1-21(2)17(12-18(22)23)19(21)20(24)25-13-14-7-6-10-16(11-14)26-15-8-4-3-5-9-15/h3-12,17,19H,13H2,1-2H3
46 atoms
Cl 2.963201 -4.827733 -0.444876
Cl 5.127592 -3.586462 -1.892778
O  -1.090955 -0.132099 -1.890039
O  -1.237173 -1.842436 -0.453353
O  -2.998038 3.656459 1.02084
C  1.520555 -0.700134 0.502079
C  1.743649 -1.921809 -0.343241
C  0.875662 -0.795441 -0.864146
C  2.612813 0.332979 0.647943
C  0.693583 -0.856093 1.755261
C  3.027332 -2.193283 -1.002317
C  -0.580611 -1.011642 -1.019124
C  3.617057 -3.379086 -1.095556
C  -2.504873 -0.133052 -2.051561
C  -3.206936 0.557974 -0.915116
C  -2.731886 1.77495 -0.441246
C  -4.362105 0.014168 -0.368927
C  -3.415194 2.436468 0.568927
C  -5.047082 0.691428 0.62792
C  -4.576082 1.903112 1.107514
C  -1.713487 3.804598 1.451488
C  -1.034999 2.799788 2.131182
C  -1.108577 5.034782 1.230773
C  0.252831 3.038141 2.587022
C  0.177608 5.258917 1.695397
C  0.867352 4.262666 2.371089
H  1.190877 -2.796989 -0.021581
H  1.314887 -0.154994 -1.620977
H  3.328763 0.029001 1.413535
H  3.168109 0.505305 -0.273359
H  2.183763 1.290564 0.948447
H  -0.029112 -1.664961 1.693164
H  1.35135 -1.057913 2.602098
H  0.147717 0.06417 1.96942
H  3.5497 -1.362989 -1.461464
H  -2.676146 0.406184 -2.984369
H  -2.884015 -1.149363 -2.176165
H  -1.832901 2.213764 -0.858065
H  -4.724797 -0.943682 -0.719314
H  -5.94687 0.263991 1.049689
H  -5.098287 2.435905 1.891103
H  -1.509092 1.843847 2.314488
H  -1.651428 5.807778 0.703001
H  0.775096 2.257827 3.125776
H  0.643867 6.219819 1.522249
H  1.870804 4.441489 2.73256
totalener: -1958.42631158 hartree
nucrepener: 2524.32395632 hartree
electener: -4482.75026789 hartree
oneelecener: -7701.53083880 hartree
twoeener: 3218.78057091 hartree
kineticenergy: 1952.61816462 hartree
xcener: -143.514407944725 hartree
chargesum: -0.0000000
charge: -0.040755 -0.048886 -0.273973 -0.371891 -0.301370 0.095597 0.036469 -0.070873 -0.252452 -0.246139 -0.202586 0.329172 0.048344 0.067761 0.041194 -0.193087 -0.153325 0.201181 -0.091824 -0.195995 0.216704 -0.113677 -0.199101 -0.183401 -0.094012 -0.136336 0.085797 0.076567 0.097337 0.071907 0.093431 0.109333 0.093419 0.052965 0.094927 0.109066 0.103797 0.125084 0.107961 0.125545 0.127423 0.139438 0.125835 0.141103 0.125451 0.126877
qa: -0.0408 -0.0489 -0.2740 -0.3719 -0.3014 0.0956 0.0365 -0.0709 -0.2525 -0.2461 -0.2026 0.3292 0.0483 0.0678 0.0412 -0.1931 -0.1533 0.2012 -0.0918 -0.1960 0.2167 -0.1137 -0.1991 -0.1834 -0.0940 -0.1363 0.0858 0.0766 0.0973 0.0719 0.0934 0.1093 0.0934 0.0530 0.0949 0.1091 0.1038 0.1251 0.1080 0.1255 0.1274 0.1394 0.1258 0.1411 0.1255 0.1269
va: 1.2867 1.2559 2.1216 2.1311 2.0996 3.7104 3.8534 3.8455 3.9137 3.9093 3.9231 4.2685 4.2464 3.8602 3.6835 3.9493 4.0101 3.8435 3.9387 4.0413 3.8523 3.8614 4.0236 3.9364 3.9526 3.9519 1.0507 1.0363 1.0020 1.0129 1.0084 1.0275 1.0014 1.0197 1.0316 0.9884 1.0129 1.0228 1.0126 0.9997 1.0110 0.9997 1.0135 0.9909 0.9982 1.0004
dispcorr: -0.024518006 hartree
energy: -1958.450829584345
dipole: -17.99753 17.91713 -0.08039 28.86943 -27.97074 0.89869 13.78623 -13.81151 -0.02528
magnitude: 0.90263 au
magnitude: 2.29431 debye
