program: Orca
programVersion: 5.0.3
elementType: Cl Cl O O O C C C C C C C C C C C C C C C C C C C C C H H H H H H H H H H H H H H H H H H H H
charge: 0
multiplicity: 1
keywords: wb97x-d3
keywords: def2-TZVPP
keywords: def2/J RIJCOSX
keywords: DEFGRID2
keywords: scfconv7
keywords: smallprint printgap noloewdin
keywords: NOSOSCF
formula: C21H20Cl2O3
InChI: InChI=1/C21H20Cl2O3/c1-21(2)17(12-18(22)23)19(21)20(24)25-13-14-7-6-10-16(11-14)26-15-8-4-3-5-9-15/h3-12,17,19H,13H2,1-2H3
46 atoms
Cl 4.548282 -2.132518 1.253876
Cl 4.716119 -4.743056 0.036115
O  -1.725762 -1.832679 0.467806
O  -0.232719 -0.251017 1.000108
O  -3.30369 3.559673 0.010733
C  1.190649 -1.283071 -1.583017
C  1.857834 -1.866487 -0.370632
C  0.356176 -1.987822 -0.534031
C  1.311854 -1.985267 -2.915084
C  1.167256 0.22037 -1.715715
C  2.684246 -3.077541 -0.445022
C  -0.530589 -1.245226 0.392045
C  3.82648 -3.280158 0.199842
C  -2.738927 -1.172108 1.234191
C  -3.385433 -0.080443 0.430416
C  -3.028448 1.246265 0.630218
C  -4.320912 -0.40455 -0.547163
C  -3.592869 2.240299 -0.160181
C  -4.891823 0.594426 -1.317488
C  -4.525174 1.918604 -1.135558
C  -2.026056 3.967579 0.26415
C  -0.911202 3.336808 -0.274627
C  -1.879377 5.099143 1.05471
C  0.350469 3.843821 -0.004925
C  -0.612303 5.600466 1.305745
C  0.509102 4.974061 0.782457
H  2.165555 -1.135539 0.3683
H  -0.023449 -2.959571 -0.829439
H  1.242533 -3.069583 -2.838171
H  0.51538 -1.659435 -3.585418
H  2.265336 -1.747222 -3.389213
H  2.060278 0.551354 -2.248367
H  0.299385 0.54391 -2.294157
H  1.142016 0.729088 -0.755432
H  2.343028 -3.888936 -1.075753
H  -3.45866 -1.954771 1.471898
H  -2.328161 -0.789236 2.169459
H  -2.298199 1.497816 1.388481
H  -4.604036 -1.438048 -0.703412
H  -5.624035 0.343655 -2.073326
H  -4.959405 2.704911 -1.7388
H  -1.016704 2.455148 -0.89284
H  -2.75832 5.580209 1.463207
H  1.217194 3.346228 -0.420032
H  -0.503677 6.483269 1.921845
H  1.49744 5.362231 0.987151
totalener: -1958.42634633 hartree
nucrepener: 2512.05885971 hartree
electener: -4470.48520604 hartree
oneelecener: -7677.23035755 hartree
twoeener: 3206.74515151 hartree
kineticenergy: 1952.62214596 hartree
xcener: -143.514606663286 hartree
chargesum: 0.0000000
charge: -0.040431 -0.048394 -0.262223 -0.391594 -0.299559 0.091821 0.043334 -0.090834 -0.247685 -0.277202 -0.204489 0.367372 0.050209 0.042839 -0.008993 -0.152302 -0.190639 0.239489 -0.085108 -0.213911 0.258621 -0.157042 -0.220053 -0.095994 -0.086900 -0.156380 0.087671 0.076810 0.072905 0.094099 0.099054 0.095844 0.091838 0.088989 0.095592 0.111351 0.111018 0.135398 0.110524 0.125165 0.126190 0.125849 0.122175 0.118436 0.123668 0.123471
qa: -0.0404 -0.0484 -0.2622 -0.3916 -0.2996 0.0918 0.0433 -0.0908 -0.2477 -0.2772 -0.2045 0.3674 0.0502 0.0428 -0.0090 -0.1523 -0.1906 0.2395 -0.0851 -0.2139 0.2586 -0.1570 -0.2201 -0.0960 -0.0869 -0.1564 0.0877 0.0768 0.0729 0.0941 0.0991 0.0958 0.0918 0.0890 0.0956 0.1114 0.1110 0.1354 0.1105 0.1252 0.1262 0.1258 0.1222 0.1184 0.1237 0.1235
va: 1.2871 1.2568 2.1390 2.1043 2.1172 3.7259 3.8269 3.8736 3.9111 3.9222 3.9181 4.2278 4.2476 3.8681 3.6718 3.8925 4.0231 3.8422 3.9317 4.0529 3.8480 3.9371 4.0349 3.9479 3.9375 3.9972 1.0481 1.0362 1.0102 1.0041 1.0026 1.0039 0.9975 1.0197 1.0315 0.9939 1.0099 1.0208 1.0120 0.9990 1.0127 0.9989 1.0153 1.0023 0.9986 1.0014
dispcorr: -0.023805942 hartree
energy: -1958.450152273510
dipole: -24.58122 23.95951 -0.62171 19.89967 -20.25295 -0.35328 -13.96066 13.24170 -0.71896
magnitude: 1.01402 au
magnitude: 2.57743 debye
