program: Orca
programVersion: 5.0.3
elementType: Cl Cl O O O C C C C C C C C C C C C C C C C C C C C C H H H H H H H H H H H H H H H H H H H H
charge: 0
multiplicity: 1
keywords: wb97x-d3
keywords: def2-TZVPP
keywords: def2/J RIJCOSX
keywords: DEFGRID2
keywords: scfconv7
keywords: smallprint printgap noloewdin
keywords: NOSOSCF
formula: C21H20Cl2O3
InChI: InChI=1/C21H20Cl2O3/c1-21(2)17(12-18(22)23)19(21)20(24)25-13-14-7-6-10-16(11-14)26-15-8-4-3-5-9-15/h3-12,17,19H,13H2,1-2H3
46 atoms
Cl 2.763454 -4.962289 -2.520094
Cl 4.365464 -2.970102 -3.857925
O  -1.046956 -0.558129 -0.015556
O  -0.848355 -2.743844 0.413243
O  -3.258524 4.044544 1.486388
C  2.177757 -1.9844 0.759519
C  1.954804 -2.600796 -0.591627
C  1.086412 -1.444142 -0.138838
C  3.364105 -1.076449 0.983694
C  1.841936 -2.81582 1.973877
C  2.883249 -2.396219 -1.710015
C  -0.352318 -1.687715 0.121746
C  3.278132 -3.324676 -2.572728
C  -2.458148 -0.628466 0.205938
C  -3.018598 0.733285 -0.071648
C  -2.843202 1.75556 0.854502
C  -3.70364 0.986027 -1.252539
C  -3.345809 3.021913 0.591382
C  -4.211582 2.25187 -1.503798
C  -4.030018 3.275355 -0.59017
C  -2.11661 4.256643 2.200586
C  -0.849715 4.090357 1.654372
C  -2.266721 4.717167 3.50142
C  0.264486 4.384851 2.425111
C  -1.143785 5.017148 4.255832
C  0.126568 4.849548 3.724788
H  1.458253 -3.56416 -0.568556
H  1.297263 -0.478168 -0.584266
H  3.565428 -0.412544 0.143605
H  3.19399 -0.446348 1.857913
H  4.26632 -1.662267 1.166054
H  2.717408 -3.395064 2.271463
H  1.568284 -2.176796 2.815474
H  1.024891 -3.510647 1.80072
H  3.284978 -1.402155 -1.862732
H  -2.907038 -1.37723 -0.45041
H  -2.655889 -0.937138 1.235613
H  -2.319289 1.56004 1.782789
H  -3.842063 0.193094 -1.976509
H  -4.747698 2.446204 -2.423067
H  -4.420176 4.266828 -0.777961
H  -0.729642 3.741038 0.637003
H  -3.260872 4.844189 3.909501
H  1.250176 4.257162 1.997424
H  -1.265964 5.380214 5.267781
H  1.000878 5.082558 4.317019
totalener: -1958.42662833 hartree
nucrepener: 2411.84764733 hartree
electener: -4370.27427566 hartree
oneelecener: -7476.49499745 hartree
twoeener: 3106.22072179 hartree
kineticenergy: 1952.61498340 hartree
xcener: -143.510383560944 hartree
chargesum: -0.0000000
charge: -0.040355 -0.048927 -0.254833 -0.382774 -0.298689 0.066642 0.049176 -0.082847 -0.242445 -0.250858 -0.202483 0.336200 0.049273 0.048946 0.011899 -0.162579 -0.153126 0.219319 -0.099357 -0.198124 0.251798 -0.165518 -0.218643 -0.114767 -0.086817 -0.150182 0.085323 0.076070 0.071113 0.092658 0.098343 0.088503 0.085057 0.104787 0.095053 0.095305 0.106588 0.120679 0.111647 0.126306 0.127550 0.132793 0.125658 0.125553 0.125901 0.125180
qa: -0.0404 -0.0489 -0.2548 -0.3828 -0.2987 0.0666 0.0492 -0.0828 -0.2424 -0.2509 -0.2025 0.3362 0.0493 0.0489 0.0119 -0.1626 -0.1531 0.2193 -0.0994 -0.1981 0.2518 -0.1655 -0.2186 -0.1148 -0.0868 -0.1502 0.0853 0.0761 0.0711 0.0927 0.0983 0.0885 0.0851 0.1048 0.0951 0.0953 0.1066 0.1207 0.1116 0.1263 0.1276 0.1328 0.1257 0.1256 0.1259 0.1252
va: 1.2870 1.2560 2.1364 2.1194 2.1076 3.7587 3.8163 3.8828 3.9092 3.9129 3.9186 4.2408 4.2460 3.8467 3.7771 3.9310 3.9818 3.8490 3.9577 4.0343 3.8098 3.9373 4.0388 3.9465 3.9334 3.9661 1.0507 1.0354 1.0100 1.0043 1.0031 1.0014 1.0020 1.0226 1.0310 1.0059 0.9983 1.0149 1.0107 0.9999 1.0121 1.0047 1.0143 1.0001 0.9986 1.0006
dispcorr: -0.020692695 hartree
energy: -1958.447321020651
dipole: -11.41153 11.56208 0.15055 22.30082 -21.34545 0.95537 27.76233 -27.26607 0.49626
magnitude: 1.08705 au
magnitude: 2.76305 debye
