program: Orca
programVersion: 5.0.3
elementType: Cl Cl O O O C C C C C C C C C C C C C C C C C C C C C H H H H H H H H H H H H H H H H H H H H
charge: 0
multiplicity: 1
keywords: wb97x-d3
keywords: def2-TZVPP
keywords: def2/J RIJCOSX
keywords: DEFGRID2
keywords: scfconv7
keywords: smallprint printgap noloewdin
keywords: NOSOSCF
formula: C21H20Cl2O3
InChI: InChI=1/C21H20Cl2O3/c1-21(2)17(12-18(22)23)19(21)20(24)25-13-14-7-6-10-16(11-14)26-15-8-4-3-5-9-15/h3-12,17,19H,13H2,1-2H3
46 atoms
Cl 1.724528 0.5646 -0.384218
Cl 4.591334 0.264319 -0.389179
O  -1.42858 -1.940178 0.955988
O  -1.332144 -2.53715 -1.198952
O  -1.91015 2.896806 -0.644712
C  1.390752 -3.802729 -0.304727
C  1.648022 -2.500546 -0.988156
C  0.651708 -2.551592 0.143341
C  2.418223 -4.324545 0.671841
C  0.681643 -4.897252 -1.06316
C  2.935686 -1.792017 -0.816745
C  -0.785627 -2.350852 -0.14677
C  3.0577 -0.496374 -0.562016
C  -2.826649 -1.732442 0.856129
C  -3.214183 -0.420948 0.225152
C  -2.313747 0.627035 0.09672
C  -4.533296 -0.252453 -0.179567
C  -2.741644 1.8410 -0.429974
C  -4.948856 0.961055 -0.700836
C  -4.060554 2.015342 -0.824743
C  -0.814677 3.131777 0.130243
C  0.300479 3.653131 -0.511938
C  -0.804778 2.939386 1.507103
C  1.428429 3.977085 0.224747
C  0.336021 3.25586 2.228679
C  1.456233 3.773391 1.595787
H  1.197679 -2.396607 -1.972584
H  0.978095 -2.144101 1.093189
H  2.912341 -3.527403 1.227618
H  1.949295 -4.990893 1.397194
H  3.189818 -4.896518 0.152224
H  1.415918 -5.51437 -1.584077
H  0.130851 -5.548407 -0.382056
H  -0.017986 -4.516886 -1.802689
H  3.850341 -2.362733 -0.930315
H  -3.303196 -2.55657 0.31969
H  -3.182639 -1.75783 1.887811
H  -1.282649 0.498734 0.398537
H  -5.236296 -1.072064 -0.092801
H  -5.975721 1.089542 -1.016331
H  -4.374406 2.965704 -1.235348
H  0.275559 3.8021 -1.583351
H  -1.67747 2.551277 2.015796
H  2.295886 4.378011 -0.282343
H  0.341994 3.100663 3.29949
H  2.34224 4.015776 2.166365
totalener: -1958.42317128 hartree
nucrepener: 2650.71270324 hartree
electener: -4609.13587452 hartree
oneelecener: -7954.96441023 hartree
twoeener: 3345.82853571 hartree
kineticenergy: 1952.62075899 hartree
xcener: -143.518012539174 hartree
chargesum: -0.0000000
charge: -0.024234 -0.048904 -0.278510 -0.367615 -0.293599 0.108573 0.000142 -0.135306 -0.271536 -0.253386 -0.258376 0.334835 0.104131 0.051426 0.068505 -0.230894 -0.216996 0.334582 -0.070847 -0.238922 0.285647 -0.251650 -0.195040 -0.078669 -0.100443 -0.141668 0.107970 0.103543 0.088523 0.095013 0.092473 0.084849 0.086311 0.104905 0.116240 0.103871 0.113525 0.095131 0.104171 0.123107 0.122722 0.121496 0.133475 0.123025 0.125223 0.123182
qa: -0.0242 -0.0489 -0.2785 -0.3676 -0.2936 0.1086 0.0001 -0.1353 -0.2715 -0.2534 -0.2584 0.3348 0.1041 0.0514 0.0685 -0.2309 -0.2170 0.3346 -0.0708 -0.2389 0.2856 -0.2517 -0.1950 -0.0787 -0.1004 -0.1417 0.1080 0.1035 0.0885 0.0950 0.0925 0.0848 0.0863 0.1049 0.1162 0.1039 0.1135 0.0951 0.1042 0.1231 0.1227 0.1215 0.1335 0.1230 0.1252 0.1232
va: 1.3307 1.2583 2.1179 2.1316 2.1250 3.7395 3.8295 3.8577 3.9134 3.9000 3.9211 4.1922 4.1885 3.8640 3.7166 3.9676 4.0438 3.7185 3.9365 4.0547 3.7315 3.9923 3.9353 3.8917 3.9378 3.9588 1.0268 1.0255 1.0004 1.0059 1.0017 1.0023 1.0019 1.0224 1.0173 1.0122 0.9839 1.0405 1.0104 0.9993 1.0152 1.0189 1.0032 0.9998 0.9996 1.0006
dispcorr: -0.025875954 hartree
energy: -1958.449047231429
dipole: -13.11791 13.30903 0.19111 -18.75714 17.98565 -0.77149 4.92833 -4.19713 0.73120
magnitude: 1.07999 au
magnitude: 2.74511 debye
