program: Orca
programVersion: 5.0.3
elementType: Cl Cl O O O C C C C C C C C C C C C C C C C C C C C C H H H H H H H H H H H H H H H H H H H H
charge: 0
multiplicity: 1
keywords: wb97x-d3
keywords: def2-TZVPP
keywords: def2/J RIJCOSX
keywords: DEFGRID2
keywords: scfconv7
keywords: smallprint printgap noloewdin
keywords: NOSOSCF
formula: C21H20Cl2O3
InChI: InChI=1/C21H20Cl2O3/c1-21(2)17(12-18(22)23)19(21)20(24)25-13-14-7-6-10-16(11-14)26-15-8-4-3-5-9-15/h3-12,17,19H,13H2,1-2H3
46 atoms
Cl 3.167873 -4.806268 -3.171777
Cl 5.266013 -2.825849 -3.118086
O  -0.98487 -0.889218 -0.266855
O  -1.067601 -3.04065 -0.866261
O  -2.023947 3.11823 2.43472
C  1.690484 -3.108204 0.640243
C  1.896253 -3.117521 -0.846977
C  1.016709 -2.057257 -0.218796
C  2.795077 -2.615788 1.54551
C  0.895802 -4.239199 1.246787
C  3.168362 -2.723925 -1.46533
C  -0.439066 -2.085997 -0.49402
C  3.77733 -3.371159 -2.451394
C  -2.389569 -0.772277 -0.456545
C  -2.83189 0.599416 -0.037755
C  -2.196291 1.286403 0.988023
C  -3.93785 1.168997 -0.657992
C  -2.67261 2.524988 1.393929
C  -4.412473 2.401192 -0.23803
C  -3.789779 3.088875 0.79037
C  -1.920293 4.478143 2.490222
C  -1.543308 5.23308 1.385647
C  -2.150571 5.088528 3.713831
C  -1.406665 6.605729 1.515986
C  -1.999544 6.46174 3.832534
C  -1.634357 7.227089 2.735443
H  1.347511 -3.892785 -1.369261
H  1.435837 -1.060412 -0.134764
H  2.38674 -2.328761 2.515494
H  3.531785 -3.40272 1.714177
H  3.322786 -1.74932 1.148663
H  0.140565 -4.638271 0.57527
H  1.569879 -5.054704 1.512622
H  0.396354 -3.913657 2.160971
H  3.660842 -1.830612 -1.101406
H  -2.646341 -0.953748 -1.503525
H  -2.908933 -1.532243 0.134841
H  -1.326839 0.873827 1.482018
H  -4.431892 0.64979 -1.469946
H  -5.279514 2.835446 -0.717597
H  -4.170426 4.048488 1.114425
H  -1.354553 4.754331 0.433454
H  -2.44047 4.48529 4.56408
H  -1.112433 7.192235 0.655585
H  -2.179086 6.934785 4.78874
H  -1.523049 8.298496 2.830224
totalener: -1958.42696438 hartree
nucrepener: 2363.48223263 hartree
electener: -4321.90919701 hartree
oneelecener: -7379.86436353 hartree
twoeener: 3057.95516653 hartree
kineticenergy: 1952.61366087 hartree
xcener: -143.513510297456 hartree
chargesum: 0.0000000
charge: -0.040589 -0.048327 -0.269348 -0.379239 -0.297892 0.067885 0.043744 -0.074527 -0.241586 -0.249865 -0.201614 0.326629 0.049756 0.074380 0.061300 -0.219426 -0.183904 0.216832 -0.115199 -0.161408 0.234947 -0.160800 -0.203310 -0.116421 -0.094738 -0.142195 0.086390 0.077919 0.093626 0.098171 0.072060 0.103403 0.089105 0.086180 0.096767 0.097895 0.105267 0.112054 0.109181 0.125946 0.132168 0.134296 0.125198 0.127633 0.125863 0.125792
qa: -0.0406 -0.0483 -0.2693 -0.3792 -0.2979 0.0679 0.0437 -0.0745 -0.2416 -0.2499 -0.2016 0.3266 0.0498 0.0744 0.0613 -0.2194 -0.1839 0.2168 -0.1152 -0.1614 0.2349 -0.1608 -0.2033 -0.1164 -0.0947 -0.1422 0.0864 0.0779 0.0936 0.0982 0.0721 0.1034 0.0891 0.0862 0.0968 0.0979 0.1053 0.1121 0.1092 0.1259 0.1322 0.1343 0.1252 0.1276 0.1259 0.1258
va: 1.2866 1.2569 2.1391 2.1254 2.1043 3.7620 3.8271 3.8714 3.9095 3.9125 3.9206 4.2473 4.2456 3.8259 3.7328 4.0634 4.0117 3.8760 3.9728 3.9365 3.8147 3.9461 4.0350 3.9458 3.9346 3.9582 1.0514 1.0339 1.0043 1.0033 1.0098 1.0221 1.0018 1.0017 1.0298 1.0026 0.9957 1.0392 1.0129 1.0015 1.0044 1.0028 1.0137 0.9998 0.9989 1.0004
dispcorr: -0.020440565 hartree
energy: -1958.447404942247
dipole: -22.44763 22.13605 -0.31158 19.70339 -18.67815 1.02525 26.50025 -25.79461 0.70565
magnitude: 1.28302 au
magnitude: 3.26119 debye
