program: Orca
programVersion: 5.0.3
elementType: Cl Cl O O O C C C C C C C C C C C C C C C C C C C C C H H H H H H H H H H H H H H H H H H H H
charge: 0
multiplicity: 1
keywords: wb97x-d3
keywords: def2-TZVPP
keywords: def2/J RIJCOSX
keywords: DEFGRID2
keywords: scfconv7
keywords: smallprint printgap noloewdin
keywords: NOSOSCF
formula: C21H20Cl2O3
InChI: InChI=1/C21H20Cl2O3/c1-21(2)17(12-18(22)23)19(21)20(24)25-13-14-7-6-10-16(11-14)26-15-8-4-3-5-9-15/h3-12,17,19H,13H2,1-2H3
46 atoms
Cl 1.507709 0.180965 1.264781
Cl 4.172149 0.643606 0.29187
O  -1.431635 -2.051407 1.082245
O  -1.61136 -2.654832 -1.062957
O  -1.709966 2.630631 -0.92633
C  1.364756 -3.47491 -0.927363
C  1.360303 -1.985741 -1.099347
C  0.537924 -2.615573 0.002051
C  2.576676 -4.110643 -0.285758
C  0.737255 -4.342858 -1.991053
C  2.557227 -1.16225 -0.828501
C  -0.934414 -2.471211 -0.089352
C  2.705247 -0.24324 0.116847
C  -2.814155 -1.730032 1.114121
C  -3.16574 -0.489869 0.334319
C  -2.230869 0.51404 0.115447
C  -4.461741 -0.341394 -0.142096
C  -2.594427 1.65053 -0.595914
C  -4.818849 0.805533 -0.83315
C  -3.892112 1.806728 -1.064876
C  -0.632695 2.912303 -0.137002
C  -0.756689 3.118633 1.231297
C  0.595751 3.064769 -0.762462
C  0.360865 3.481602 1.967094
C  1.703924 3.434381 -0.01582
C  1.592939 3.641697 1.350142
H  0.775624 -1.636484 -1.94776
H  0.929758 -2.521076 1.00699
H  3.344017 -4.318949 -1.033722
H  3.025321 -3.47933 0.481312
H  2.30619 -5.059222 0.180357
H  0.356792 -5.269148 -1.557478
H  -0.084718 -3.858109 -2.508898
H  1.493498 -4.613594 -2.730116
H  3.399846 -1.305921 -1.496219
H  -3.415487 -2.572276 0.762902
H  -3.034568 -1.582903 2.172827
H  -1.214895 0.404374 0.471568
H  -5.189831 -1.128281 0.011428
H  -5.828424 0.917689 -1.205717
H  -4.158086 2.697811 -1.617667
H  -1.718519 3.008219 1.715905
H  0.67432 2.900854 -1.829094
H  0.262348 3.645533 3.032188
H  2.661579 3.548093 -0.505722
H  2.460865 3.921617 1.931165
totalener: -1958.42037970 hartree
nucrepener: 2711.60950977 hartree
electener: -4670.02988947 hartree
oneelecener: -8076.85969627 hartree
twoeener: 3406.82980680 hartree
kineticenergy: 1952.63171464 hartree
xcener: -143.521727062359 hartree
chargesum: -0.0000000
charge: -0.028001 -0.055855 -0.271054 -0.365078 -0.298242 0.119953 -0.012632 -0.120484 -0.261727 -0.248474 -0.251644 0.311747 0.126283 0.050643 0.050461 -0.176588 -0.197350 0.286990 -0.074930 -0.236291 0.273356 -0.174065 -0.207066 -0.106286 -0.124384 -0.131251 0.104986 0.102126 0.089897 0.087290 0.095626 0.085401 0.103871 0.080209 0.113619 0.103695 0.107752 0.075621 0.102664 0.122685 0.123671 0.128481 0.121920 0.124693 0.125694 0.122071
qa: -0.0280 -0.0559 -0.2711 -0.3651 -0.2982 0.1200 -0.0126 -0.1205 -0.2617 -0.2485 -0.2516 0.3117 0.1263 0.0506 0.0505 -0.1766 -0.1973 0.2870 -0.0749 -0.2363 0.2734 -0.1741 -0.2071 -0.1063 -0.1244 -0.1313 0.1050 0.1021 0.0899 0.0873 0.0956 0.0854 0.1039 0.0802 0.1136 0.1037 0.1078 0.0756 0.1027 0.1227 0.1237 0.1285 0.1219 0.1247 0.1257 0.1221
va: 1.3197 1.2477 2.1152 2.1287 2.1158 3.7411 3.8308 3.8702 3.9108 3.8986 3.9374 4.2396 4.1466 3.8601 3.7152 3.9446 4.0269 3.7548 3.9473 4.0433 3.7726 3.9428 3.9898 3.9087 3.8757 3.9183 1.0263 1.0308 1.0033 1.0011 1.0053 1.0027 1.0252 1.0016 1.0229 1.0086 0.9852 1.0595 1.0107 0.9993 1.0149 1.0058 1.0152 1.0002 1.0066 1.0029
dispcorr: -0.028217034 hartree
energy: -1958.448596733942
dipole: -10.45440 10.75268 0.29827 -16.31375 15.81265 -0.50110 -6.70458 7.08686 0.38229
magnitude: 0.69729 au
magnitude: 1.77237 debye
