program: Orca
programVersion: 5.0.3
elementType: Cl Cl O O O C C C C C C C C C C C C C C C C C C C C C H H H H H H H H H H H H H H H H H H H H
charge: 0
multiplicity: 1
keywords: wb97x-d3
keywords: def2-TZVPP
keywords: def2/J RIJCOSX
keywords: DEFGRID2
keywords: scfconv7
keywords: smallprint printgap noloewdin
keywords: NOSOSCF
formula: C21H20Cl2O3
InChI: InChI=1/C21H20Cl2O3/c1-21(2)17(12-18(22)23)19(21)20(24)25-13-14-7-6-10-16(11-14)26-15-8-4-3-5-9-15/h3-12,17,19H,13H2,1-2H3
46 atoms
Cl 3.741269 -3.68967 1.157427
Cl 4.933189 -4.032824 -1.448242
O  -1.613894 -1.11628 -1.411276
O  -0.936818 -1.516849 0.688689
O  -2.629069 3.585174 0.067377
C  1.669231 -0.124938 -0.4448
C  1.873576 -1.604371 -0.283184
C  0.667203 -1.094851 -1.039793
C  2.512711 0.644657 -1.433069
C  1.327519 0.679422 0.784502
C  2.917354 -2.332045 -1.016554
C  -0.682431 -1.275397 -0.458735
C  3.74757 -3.227434 -0.496483
C  -2.975149 -1.202632 -1.033912
C  -3.549692 0.110324 -0.56877
C  -2.785235 1.259253 -0.456049
C  -4.907608 0.163334 -0.262266
C  -3.372664 2.441634 -0.021889
C  -5.48638 1.349706 0.15018
C  -4.720297 2.49992 0.282535
C  -1.56595 3.615987 0.919884
C  -0.540847 4.50088 0.607526
C  -1.499363 2.843893 2.073816
C  0.547728 4.616771 1.456366
C  -0.400608 2.969613 2.911405
C  0.626291 3.851306 2.611446
H  1.650889 -1.981642 0.708372
H  0.698402 -1.175275 -2.120929
H  2.695733 0.101183 -2.359394
H  2.018711 1.580571 -1.697765
H  3.482013 0.891807 -0.997656
H  2.245406 1.024427 1.262664
H  0.745918 1.565984 0.52452
H  0.762215 0.114646 1.521182
H  3.029438 -2.134487 -2.075669
H  -3.501658 -1.535437 -1.929961
H  -3.116826 -1.962803 -0.26164
H  -1.733328 1.261351 -0.709847
H  -5.516448 -0.728681 -0.351671
H  -6.542716 1.381246 0.381271
H  -5.159859 3.431482 0.612748
H  -0.609076 5.095801 -0.293898
H  -2.291496 2.150519 2.323642
H  1.341566 5.308921 1.207988
H  -0.352392 2.367316 3.808987
H  1.478588 3.942222 3.270886
totalener: -1958.42613976 hartree
nucrepener: 2541.92780027 hartree
electener: -4500.35394003 hartree
oneelecener: -7736.84770951 hartree
twoeener: 3236.49376948 hartree
kineticenergy: 1952.61368555 hartree
xcener: -143.516189756767 hartree
chargesum: 0.0000000
charge: -0.040890 -0.048917 -0.273679 -0.361644 -0.299467 0.095507 0.043983 -0.083767 -0.243441 -0.229011 -0.201606 0.296422 0.047492 0.041567 0.051135 -0.138084 -0.191668 0.184815 -0.098726 -0.177981 0.221215 -0.195114 -0.127240 -0.089908 -0.141582 -0.155336 0.087711 0.077561 0.072131 0.095734 0.098362 0.093072 0.044937 0.105411 0.095551 0.117944 0.115900 0.119078 0.111010 0.126316 0.127026 0.123988 0.128366 0.124467 0.127321 0.124040
qa: -0.0409 -0.0489 -0.2737 -0.3616 -0.2995 0.0955 0.0440 -0.0838 -0.2434 -0.2290 -0.2016 0.2964 0.0475 0.0416 0.0511 -0.1381 -0.1917 0.1848 -0.0987 -0.1780 0.2212 -0.1951 -0.1272 -0.0899 -0.1416 -0.1553 0.0877 0.0776 0.0721 0.0957 0.0984 0.0931 0.0449 0.1054 0.0956 0.1179 0.1159 0.1191 0.1110 0.1263 0.1270 0.1240 0.1284 0.1245 0.1273 0.1240
va: 1.2866 1.2562 2.1251 2.1351 2.1006 3.7626 3.8392 3.8664 3.9052 3.8952 3.9165 4.2713 4.2439 3.8756 3.6884 3.9835 4.0124 3.8800 3.9382 4.0266 3.8038 3.9921 3.8598 3.9248 3.9188 3.9221 1.0509 1.0374 1.0101 1.0037 1.0034 1.0060 1.0157 1.0187 1.0297 0.9868 1.0097 1.0086 1.0081 0.9996 1.0104 1.0149 1.0097 0.9987 1.0015 1.0017
dispcorr: -0.025389578 hartree
energy: -1958.451529339821
dipole: -20.54102 20.07351 -0.46751 29.35540 -28.87081 0.48458 1.65007 -2.13737 -0.48730
magnitude: 0.83118 au
magnitude: 2.11268 debye
