program: Orca
programVersion: 5.0.3
elementType: Cl Cl O O O C C C C C C C C C C C C C C C C C C C C C H H H H H H H H H H H H H H H H H H H H
charge: 0
multiplicity: 1
keywords: wb97x-d3
keywords: def2-TZVPP
keywords: def2/J RIJCOSX
keywords: DEFGRID2
keywords: scfconv7
keywords: smallprint printgap noloewdin
keywords: NOSOSCF
formula: C21H20Cl2O3
InChI: InChI=1/C21H20Cl2O3/c1-21(2)17(12-18(22)23)19(21)20(24)25-13-14-7-6-10-16(11-14)26-15-8-4-3-5-9-15/h3-12,17,19H,13H2,1-2H3
46 atoms
Cl 2.698112 0.540294 -1.427689
Cl 5.129009 -0.613586 -0.388475
O  -1.310251 -1.790353 0.597877
O  -1.076047 -3.449608 2.075931
O  -2.65461 3.289032 -0.090311
C  0.788301 -3.390455 -0.99787
C  1.336671 -2.11012 -0.427098
C  0.63761 -3.100759 0.479427
C  1.73193 -4.511748 -1.364642
C  -0.391201 -3.293439 -1.935976
C  2.777756 -1.884388 -0.259027
C  -0.659664 -2.816583 1.143822
C  3.438951 -0.797482 -0.638111
C  -2.603148 -1.468681 1.118902
C  -3.11859 -0.33131 0.292364
C  -2.644532 0.953673 0.530999
C  -4.01847 -0.556067 -0.739488
C  -3.055244 2.004337 -0.277226
C  -4.441657 0.503453 -1.529332
C  -3.958227 1.780574 -1.310479
C  -1.445759 3.570861 0.481842
C  -1.418934 4.566702 1.446276
C  -0.272557 2.940957 0.083921
C  -0.208918 4.938175 2.012243
C  0.92822 3.312363 0.668128
C  0.966976 4.310208 1.631364
H  0.761324 -1.226824 -0.676316
H  1.276448 -3.699816 1.119164
H  2.173953 -4.335913 -2.346668
H  2.547291 -4.637548 -0.653282
H  1.192432 -5.459089 -1.407115
H  -0.034095 -3.223506 -2.964767
H  -1.015662 -4.186238 -1.864766
H  -1.018711 -2.426268 -1.748092
H  3.364576 -2.658464 0.220523
H  -3.262157 -2.337427 1.053964
H  -2.519899 -1.195636 2.173528
H  -1.951867 1.125684 1.345593
H  -4.38831 -1.556055 -0.927062
H  -5.147152 0.331955 -2.330985
H  -4.27667 2.610155 -1.927829
H  -2.341996 5.048297 1.740798
H  -0.290796 2.166537 -0.672421
H  -0.190179 5.719128 2.760741
H  1.839642 2.817394 0.360812
H  1.908702 4.597926 2.078081
totalener: -1958.42416784 hartree
nucrepener: 2558.61397788 hartree
electener: -4517.03814572 hartree
oneelecener: -7769.84993283 hartree
twoeener: 3252.81178711 hartree
kineticenergy: 1952.62275546 hartree
xcener: -143.512456695647 hartree
chargesum: 0.0000000
charge: -0.056316 -0.045087 -0.262573 -0.353900 -0.297113 0.071814 0.084921 -0.091331 -0.242235 -0.252271 -0.219649 0.324490 0.062618 0.035718 0.008826 -0.190718 -0.177471 0.259812 -0.085308 -0.211777 0.255182 -0.213261 -0.175700 -0.087809 -0.083852 -0.160009 0.077395 0.079370 0.096565 0.071795 0.095324 0.088167 0.093004 0.088105 0.099874 0.097842 0.109927 0.122409 0.111041 0.125469 0.126591 0.124908 0.126038 0.125272 0.116801 0.127100
qa: -0.0563 -0.0451 -0.2626 -0.3539 -0.2971 0.0718 0.0849 -0.0913 -0.2422 -0.2523 -0.2196 0.3245 0.0626 0.0357 0.0088 -0.1907 -0.1775 0.2598 -0.0853 -0.2118 0.2552 -0.2133 -0.1757 -0.0878 -0.0839 -0.1600 0.0774 0.0794 0.0966 0.0718 0.0953 0.0882 0.0930 0.0881 0.0999 0.0978 0.1099 0.1224 0.1110 0.1255 0.1266 0.1249 0.1260 0.1253 0.1168 0.1271
va: 1.2772 1.2618 2.0980 2.1531 2.1168 3.7468 3.7726 3.8805 3.9143 3.9195 3.9147 4.2810 4.2100 3.8568 3.7588 3.9187 3.9798 3.8317 3.9504 4.0367 3.8364 4.0439 3.9478 3.9298 3.9065 4.0166 1.0327 1.0343 1.0028 1.0102 1.0034 1.0039 1.0011 1.0168 1.0277 1.0065 1.0010 1.0146 1.0114 0.9991 1.0132 1.0141 1.0082 0.9987 1.0237 1.0010
dispcorr: -0.023669213 hartree
energy: -1958.447837051010
dipole: -21.15307 21.02916 -0.12391 -12.05499 11.83372 -0.22127 -0.96088 0.38704 -0.57383
magnitude: 0.62737 au
magnitude: 1.59466 debye
