program: Orca
programVersion: 5.0.3
elementType: Cl Cl O O O C C C C C C C C C C C C C C C C C C C C C H H H H H H H H H H H H H H H H H H H H
charge: 0
multiplicity: 1
keywords: wb97x-d3
keywords: def2-TZVPP
keywords: def2/J RIJCOSX
keywords: DEFGRID2
keywords: scfconv7
keywords: smallprint printgap noloewdin
keywords: NOSOSCF
formula: C21H20Cl2O3
InChI: InChI=1/C21H20Cl2O3/c1-21(2)17(12-18(22)23)19(21)20(24)25-13-14-7-6-10-16(11-14)26-15-8-4-3-5-9-15/h3-12,17,19H,13H2,1-2H3
46 atoms
Cl 2.237126 -0.675976 -1.027502
Cl 4.995059 -1.536464 -1.085673
O  -1.186325 -2.194024 0.751612
O  -1.317774 -2.885287 -1.376154
O  -1.041989 3.071198 1.666996
C  0.995012 -4.809772 -0.446662
C  1.521922 -3.663309 -1.243278
C  0.616992 -3.389184 -0.066845
C  1.922402 -5.507053 0.520276
C  -0.018143 -5.733794 -1.076811
C  2.942194 -3.252555 -1.193571
C  -0.721143 -2.815779 -0.333113
C  3.337383 -1.988774 -1.112318
C  -2.404078 -1.453581 0.631104
C  -2.120516 -0.051606 0.173344
C  -1.757527 0.911211 1.107137
C  -2.177303 0.287704 -1.173518
C  -1.44384 2.198866 0.700389
C  -1.862641 1.577897 -1.571863
C  -1.489586 2.539054 -0.646249
C  -1.395449 4.386829 1.60537
C  -0.447821 5.314274 2.014373
C  -2.66238 4.801785 1.212305
C  -0.771549 6.661759 2.031885
C  -2.967983 6.153805 1.223893
C  -2.028613 7.089463 1.631902
H  1.042857 -3.514276 -2.208043
H  1.091421 -3.015037 0.832912
H  1.351274 -5.994579 1.311641
H  2.503156 -6.278609 0.010505
H  2.624723 -4.822084 0.996216
H  -0.67742 -6.159545 -0.318078
H  -0.637949 -5.237001 -1.81884
H  0.494049 -6.562558 -1.568874
H  3.709426 -4.015512 -1.256968
H  -3.100328 -1.95757 -0.040089
H  -2.833575 -1.453408 1.632741
H  -1.709403 0.665643 2.161396
H  -2.451346 -0.457888 -1.907192
H  -1.898094 1.840142 -2.62091
H  -1.236305 3.53981 -0.971228
H  0.532479 4.973708 2.320758
H  -3.406717 4.078754 0.9047
H  -0.030483 7.381356 2.353799
H  -3.954824 6.474822 0.9174
H  -2.275456 8.142299 1.640343
totalener: -1958.42494740 hartree
nucrepener: 2495.01583858 hartree
electener: -4453.44078599 hartree
oneelecener: -7643.57368986 hartree
twoeener: 3190.13290388 hartree
kineticenergy: 1952.62611265 hartree
xcener: -143.513659258706 hartree
chargesum: -0.0000000
charge: -0.029357 -0.046034 -0.256665 -0.399312 -0.298374 0.117890 -0.024484 -0.133922 -0.271479 -0.252935 -0.246204 0.368024 0.094779 0.048955 0.008504 -0.230756 -0.133779 0.228503 -0.115696 -0.166724 0.250789 -0.211597 -0.169920 -0.089437 -0.115565 -0.146693 0.107420 0.102521 0.094112 0.092160 0.087281 0.087652 0.102585 0.083035 0.116939 0.110431 0.103993 0.109711 0.128178 0.128217 0.133444 0.124989 0.132885 0.124786 0.126024 0.125125
qa: -0.0294 -0.0460 -0.2567 -0.3993 -0.2984 0.1179 -0.0245 -0.1339 -0.2715 -0.2529 -0.2462 0.3680 0.0948 0.0490 0.0085 -0.2308 -0.1338 0.2285 -0.1157 -0.1667 0.2508 -0.2116 -0.1699 -0.0894 -0.1156 -0.1467 0.1074 0.1025 0.0941 0.0922 0.0873 0.0877 0.1026 0.0830 0.1169 0.1104 0.1040 0.1097 0.1282 0.1282 0.1334 0.1250 0.1329 0.1248 0.1260 0.1251
va: 1.3074 1.2596 2.1308 2.0971 2.1067 3.7174 3.8478 3.8534 3.9152 3.9003 3.9067 4.1952 4.2011 3.8452 3.6856 4.1034 3.9511 3.8599 3.9596 3.9495 3.8053 4.0369 3.9402 3.9333 3.9476 3.9622 1.0292 1.0257 1.0063 1.0013 1.0011 1.0015 1.0215 1.0030 1.0171 1.0138 0.9966 1.0248 1.0218 1.0008 1.0031 1.0143 1.0039 0.9989 1.0001 1.0005
dispcorr: -0.022942141 hartree
energy: -1958.447889543985
dipole: -21.32614 21.09869 -0.22745 -8.17865 7.89460 -0.28406 5.40494 -5.15145 0.25349
magnitude: 0.44348 au
magnitude: 1.12725 debye
