program: Orca
programVersion: 5.0.3
elementType: Cl Cl O O O C C C C C C C C C C C C C C C C C C C C C H H H H H H H H H H H H H H H H H H H H
charge: 0
multiplicity: 1
keywords: wb97x-d3
keywords: def2-TZVPP
keywords: def2/J RIJCOSX
keywords: DEFGRID2
keywords: scfconv7
keywords: smallprint printgap noloewdin
keywords: NOSOSCF
formula: C21H20Cl2O3
InChI: InChI=1/C21H20Cl2O3/c1-21(2)17(12-18(22)23)19(21)20(24)25-13-14-7-6-10-16(11-14)26-15-8-4-3-5-9-15/h3-12,17,19H,13H2,1-2H3
46 atoms
Cl 3.929099 -3.225037 1.421482
Cl 5.006951 -4.002567 -1.139283
O  -1.680551 -1.217151 -1.302481
O  -0.906273 -1.427133 0.791733
O  -2.6622 3.564213 0.011072
C  1.620158 -0.132322 -0.627346
C  1.855563 -1.571077 -0.262185
C  0.617739 -1.192489 -1.040399
C  2.42321 0.492863 -1.743343
C  1.305882 0.836441 0.484843
C  2.899476 -2.372851 -0.91455
C  -0.706267 -1.299218 -0.384777
C  3.815876 -3.100361 -0.28769
C  -3.024262 -1.275982 -0.859375
C  -3.599712 0.071222 -0.507526
C  -2.822938 1.213743 -0.41574
C  -4.969648 0.157825 -0.269268
C  -3.409693 2.423441 -0.06194
C  -5.547483 1.370867 0.058681
C  -4.769357 2.514033 0.175953
C  -1.566227 3.59513 0.821318
C  -0.552638 4.476406 0.465478
C  -1.457328 2.829574 1.976542
C  0.568935 4.592792 1.270542
C  -0.325861 2.954546 2.768806
C  0.691812 3.830351 2.423401
H  1.672282 -1.805676 0.780275
H  0.609961 -1.42375 -2.100084
H  2.574993 -0.174179 -2.591164
H  1.916069 1.383279 -2.117448
H  3.406784 0.796854 -1.381968
H  2.234254 1.229993 0.901471
H  0.733234 1.688949 0.113546
H  0.744259 0.387407 1.29986
H  2.940279 -2.377981 -1.996942
H  -3.584007 -1.707509 -1.690667
H  -3.120191 -1.95148 -0.005441
H  -1.760965 1.188822 -0.621173
H  -5.588648 -0.728281 -0.347405
H  -6.613014 1.429196 0.236729
H  -5.208464 3.466257 0.441595
H  -0.65387 5.066942 -0.435688
H  -2.241181 2.140169 2.26094
H  1.35485 5.280824 0.987955
H  -0.243207 2.354101 3.665187
H  1.570441 3.919723 3.047541
totalener: -1958.42576512 hartree
nucrepener: 2548.20439915 hartree
electener: -4506.63016428 hartree
oneelecener: -7749.40935327 hartree
twoeener: 3242.77918900 hartree
kineticenergy: 1952.61262861 hartree
xcener: -143.516745021721 hartree
chargesum: 0.0000000
charge: -0.041318 -0.048316 -0.269883 -0.359981 -0.298717 0.112700 0.045169 -0.092228 -0.240746 -0.269428 -0.202022 0.293972 0.046425 0.043980 0.050098 -0.147814 -0.191038 0.198150 -0.096237 -0.186061 0.217213 -0.195394 -0.121588 -0.094367 -0.146621 -0.148447 0.088381 0.077030 0.072355 0.095505 0.098954 0.096780 0.062657 0.107067 0.097193 0.114909 0.116928 0.121557 0.109823 0.125710 0.126797 0.123569 0.129355 0.123923 0.129582 0.124424
qa: -0.0413 -0.0483 -0.2699 -0.3600 -0.2987 0.1127 0.0452 -0.0922 -0.2407 -0.2694 -0.2020 0.2940 0.0464 0.0440 0.0501 -0.1478 -0.1910 0.1982 -0.0962 -0.1861 0.2172 -0.1954 -0.1216 -0.0944 -0.1466 -0.1484 0.0884 0.0770 0.0724 0.0955 0.0990 0.0968 0.0627 0.1071 0.0972 0.1149 0.1169 0.1216 0.1098 0.1257 0.1268 0.1236 0.1294 0.1239 0.1296 0.1244
va: 1.2860 1.2572 2.1281 2.1356 2.1051 3.7594 3.8285 3.8833 3.9010 3.9039 3.9115 4.2819 4.2412 3.8791 3.6889 3.9754 4.0052 3.8717 3.9420 4.0302 3.8063 3.9854 3.8587 3.9252 3.9105 3.9073 1.0504 1.0375 1.0099 1.0040 1.0034 1.0057 1.0068 1.0143 1.0282 0.9882 1.0081 1.0003 1.0087 0.9997 1.0109 1.0151 1.0085 0.9991 1.0008 1.0013
dispcorr: -0.025709157 hartree
energy: -1958.451474281559
dipole: -21.57476 21.07580 -0.49896 27.64242 -27.26647 0.37595 -1.58821 1.01154 -0.57667
magnitude: 0.85020 au
magnitude: 2.16104 debye
