program: Orca
programVersion: 5.0.3
elementType: Cl Cl O O O C C C C C C C C C C C C C C C C C C C C C H H H H H H H H H H H H H H H H H H H H
charge: 0
multiplicity: 1
keywords: wb97x-d3
keywords: def2-TZVPP
keywords: def2/J RIJCOSX
keywords: DEFGRID2
keywords: scfconv7
keywords: smallprint printgap noloewdin
keywords: NOSOSCF
formula: C21H20Cl2O3
InChI: InChI=1/C21H20Cl2O3/c1-21(2)17(12-18(22)23)19(21)20(24)25-13-14-7-6-10-16(11-14)26-15-8-4-3-5-9-15/h3-12,17,19H,13H2,1-2H3
46 atoms
Cl 3.772907 0.164622 -1.049004
Cl 4.230114 0.493443 1.780469
O  -2.054233 -2.227589 0.071017
O  -0.861006 -1.917861 -1.804937
O  -2.477312 2.965353 -0.246124
C  1.352924 -3.402921 -0.133732
C  1.595556 -1.9221 -0.170764
C  0.239631 -2.451871 0.247816
C  1.934762 -4.223756 0.992978
C  1.318969 -4.143244 -1.44844
C  2.422961 -1.224732 0.820599
C  -0.920152 -2.173771 -0.631116
C  3.352453 -0.319818 0.541252
C  -3.280599 -1.86506 -0.567471
C  -3.698869 -0.485738 -0.143572
C  -2.879488 0.603599 -0.419381
C  -4.896181 -0.288722 0.531361
C  -3.248486 1.87113 0.005796
C  -5.275474 0.988212 0.918862
C  -4.451448 2.072019 0.669831
C  -1.124219 2.889879 -0.067246
C  -0.552829 2.198036 0.994658
C  -0.325802 3.58293 -0.964838
C  0.825536 2.197327 1.141899
C  1.050634 3.580792 -0.798741
C  1.634136 2.885629 0.249556
H  1.6143 -1.495808 -1.167192
H  0.009554 -2.417988 1.307019
H  2.98011 -4.462783 0.79166
H  1.891616 -3.719965 1.95803
H  1.391341 -5.16416 1.095089
H  0.681324 -5.026403 -1.376893
H  0.954623 -3.531836 -2.269679
H  2.324297 -4.482281 -1.703208
H  2.259779 -1.440153 1.869591
H  -3.181707 -1.93262 -1.651649
H  -4.018296 -2.600792 -0.246096
H  -1.956775 0.470526 -0.971208
H  -5.535751 -1.133117 0.756228
H  -6.212204 1.138121 1.43899
H  -4.728749 3.069227 0.984724
H  -1.175006 1.665942 1.702736
H  -0.786273 4.119199 -1.78414
H  1.271884 1.660442 1.968439
H  1.670293 4.122306 -1.501181
H  2.708191 2.879485 0.373024
totalener: -1958.42612146 hartree
nucrepener: 2625.35132407 hartree
electener: -4583.77744552 hartree
oneelecener: -7903.86850005 hartree
twoeener: 3320.09105453 hartree
kineticenergy: 1952.61992795 hartree
xcener: -143.516064996324 hartree
chargesum: -0.0000000
charge: -0.038499 -0.053935 -0.262166 -0.390266 -0.301110 0.075031 0.055162 -0.086997 -0.241627 -0.250831 -0.208080 0.340614 0.043223 0.061432 0.007377 -0.157204 -0.191162 0.210237 -0.079702 -0.208352 0.249931 -0.169922 -0.212230 -0.096340 -0.091824 -0.140337 0.090016 0.077872 0.098169 0.070346 0.093395 0.085419 0.104366 0.087868 0.097437 0.120650 0.091141 0.151906 0.107811 0.125113 0.125785 0.126419 0.122808 0.116614 0.123558 0.120886
qa: -0.0385 -0.0539 -0.2622 -0.3903 -0.3011 0.0750 0.0552 -0.0870 -0.2416 -0.2508 -0.2081 0.3406 0.0432 0.0614 0.0074 -0.1572 -0.1912 0.2102 -0.0797 -0.2084 0.2499 -0.1699 -0.2122 -0.0963 -0.0918 -0.1403 0.0900 0.0779 0.0982 0.0703 0.0934 0.0854 0.1044 0.0879 0.0974 0.1207 0.0911 0.1519 0.1078 0.1251 0.1258 0.1264 0.1228 0.1166 0.1236 0.1209
va: 1.2854 1.2491 2.1366 2.1013 2.1073 3.7694 3.7809 3.8765 3.9105 3.9159 3.9147 4.2427 4.2275 3.8523 3.7903 3.8983 4.0174 3.8624 3.9443 4.0502 3.8024 3.9566 4.0543 3.8848 3.9896 3.9113 1.0494 1.0378 1.0029 1.0095 1.0045 1.0020 1.0213 1.0015 1.0280 1.0149 1.0011 1.0135 1.0129 0.9994 1.0123 1.0075 1.0140 1.0090 0.9999 1.0191
dispcorr: -0.026069867 hartree
energy: -1958.452191324583
dipole: -18.59795 18.20487 -0.39308 -17.65910 16.66800 -0.99111 -0.23839 0.90099 0.66260
magnitude: 1.25533 au
magnitude: 3.19078 debye
