program: Orca
programVersion: 5.0.3
elementType: Cl Cl O O O C C C C C C C C C C C C C C C C C C C C C H H H H H H H H H H H H H H H H H H H H
charge: 0
multiplicity: 1
keywords: wb97x-d3
keywords: def2-TZVPP
keywords: def2/J RIJCOSX
keywords: DEFGRID2
keywords: scfconv7
keywords: smallprint printgap noloewdin
keywords: NOSOSCF
formula: C21H20Cl2O3
InChI: InChI=1/C21H20Cl2O3/c1-21(2)17(12-18(22)23)19(21)20(24)25-13-14-7-6-10-16(11-14)26-15-8-4-3-5-9-15/h3-12,17,19H,13H2,1-2H3
46 atoms
Cl 2.420332 -2.092696 -3.825449
Cl 4.822765 -1.100756 -2.574404
O  -0.965169 -1.436533 1.489513
O  -1.420947 -2.512316 -0.417999
O  -1.672378 3.687072 0.343043
C  1.348786 -3.858344 0.137933
C  1.510592 -2.76808 -0.88234
C  0.815897 -2.472544 0.432528
C  2.53908 -4.299699 0.957317
C  0.412114 -4.995491 -0.190696
C  2.810966 -2.146696 -1.160425
C  -0.63297 -2.162601 0.419385
C  3.278456 -1.82898 -2.361832
C  -2.325873 -1.014286 1.591102
C  -2.617703 0.160887 0.702091
C  -2.007076 1.381885 0.9672
C  -3.47785 0.040084 -0.380628
C  -2.27562 2.478727 0.161326
C  -3.738885 1.141678 -1.181519
C  -3.146763 2.363903 -0.913773
C  -1.439808 4.165537 1.598355
C  -0.25515 4.859355 1.799987
C  -2.360651 4.031574 2.631187
C  0.007565 5.421039 3.039549
C  -2.079367 4.58937 3.868539
C  -0.897944 5.284581 4.081062
H  0.838871 -2.843235 -1.729781
H  1.383815 -1.907823 1.163535
H  3.160244 -4.993571 0.388648
H  3.1731 -3.473561 1.277213
H  2.204412 -4.815476 1.858526
H  0.967098 -5.789239 -0.693283
H  -0.01616 -5.418777 0.719932
H  -0.40674 -4.697479 -0.839571
H  3.457359 -1.919808 -0.321655
H  -3.004043 -1.841812 1.375576
H  -2.447336 -0.740561 2.639381
H  -1.322087 1.473915 1.80197
H  -3.930035 -0.91668 -0.604317
H  -4.409445 1.048532 -2.025341
H  -3.345879 3.228174 -1.533528
H  0.448215 4.959247 0.983794
H  -3.291279 3.502178 2.472628
H  0.931166 5.964057 3.1908
H  -2.797804 4.48403 4.670852
H  -0.687226 5.719267 5.048601
totalener: -1958.42627622 hartree
nucrepener: 2452.26833568 hartree
electener: -4410.69461190 hartree
oneelecener: -7557.82858440 hartree
twoeener: 3147.13397250 hartree
kineticenergy: 1952.62412945 hartree
xcener: -143.514040367254 hartree
chargesum: -0.0000000
charge: -0.040581 -0.049688 -0.269344 -0.389955 -0.300109 0.067519 0.044308 -0.088986 -0.245804 -0.249307 -0.201839 0.366448 0.051198 0.056283 -0.003125 -0.209688 -0.121634 0.235730 -0.095947 -0.203880 0.255566 -0.215045 -0.173316 -0.087898 -0.113329 -0.150589 0.086953 0.074979 0.098399 0.072318 0.092779 0.087450 0.083995 0.104294 0.094322 0.102096 0.113829 0.122031 0.113277 0.124878 0.126718 0.126166 0.131585 0.125241 0.126472 0.125232
qa: -0.0406 -0.0497 -0.2693 -0.3900 -0.3001 0.0675 0.0443 -0.0890 -0.2458 -0.2493 -0.2018 0.3664 0.0512 0.0563 -0.0031 -0.2097 -0.1216 0.2357 -0.0959 -0.2039 0.2556 -0.2150 -0.1733 -0.0879 -0.1133 -0.1506 0.0870 0.0750 0.0984 0.0723 0.0928 0.0875 0.0840 0.1043 0.0943 0.1021 0.1138 0.1220 0.1133 0.1249 0.1267 0.1262 0.1316 0.1252 0.1265 0.1252
va: 1.2868 1.2552 2.1291 2.1132 2.1104 3.7534 3.8246 3.8556 3.9110 3.9135 3.9241 4.2284 4.2445 3.8645 3.6859 3.9558 3.9680 3.8291 3.9519 4.0336 3.8088 4.0394 3.9417 3.9309 3.9447 3.9663 1.0495 1.0366 1.0028 1.0102 1.0040 1.0011 1.0020 1.0234 1.0313 1.0117 0.9915 1.0170 1.0200 0.9997 1.0121 1.0141 1.0048 0.9988 0.9998 1.0006
dispcorr: -0.021353217 hartree
energy: -1958.447629438493
dipole: -18.64892 18.48590 -0.16302 -4.06370 3.80555 -0.25814 27.24017 -25.94196 1.29821
magnitude: 1.33362 au
magnitude: 3.38980 debye
