program: Orca
programVersion: 5.0.3
elementType: Cl Cl O O O C C C C C C C C C C C C C C C C C C C C C H H H H H H H H H H H H H H H H H H H H
charge: 0
multiplicity: 1
keywords: wb97x-d3
keywords: def2-TZVPP
keywords: def2/J RIJCOSX
keywords: DEFGRID2
keywords: scfconv7
keywords: smallprint printgap noloewdin
keywords: NOSOSCF
formula: C21H20Cl2O3
InChI: InChI=1/C21H20Cl2O3/c1-21(2)17(12-18(22)23)19(21)20(24)25-13-14-7-6-10-16(11-14)26-15-8-4-3-5-9-15/h3-12,17,19H,13H2,1-2H3
46 atoms
Cl 1.562899 0.594021 0.402829
Cl 4.143129 0.027456 1.572395
O  -1.801485 -2.490884 0.383906
O  -1.139633 -2.054695 -1.708247
O  -1.831055 2.478808 1.313638
C  1.384556 -3.710801 -0.872166
C  1.685905 -2.257393 -0.737679
C  0.441636 -2.823014 -0.080524
C  2.172312 -4.70147 -0.048149
C  0.991908 -4.247137 -2.22711
C  2.796073 -1.759585 0.102035
C  -0.884107 -2.413338 -0.591146
C  2.824899 -0.540806 0.626019
C  -3.118034 -2.071112 0.063072
C  -3.256073 -0.577767 -0.057169
C  -2.44321 0.282801 0.670564
C  -4.248647 -0.049264 -0.872351
C  -2.634127 1.651164 0.577287
C  -4.442288 1.321474 -0.945403
C  -3.635112 2.183292 -0.221253
C  -0.794723 3.109746 0.695517
C  -0.049597 3.978303 1.486771
C  -0.45679 2.91539 -0.638421
C  1.027884 4.650738 0.939642
C  0.627093 3.601841 -1.170837
C  1.373831 4.469657 -0.393324
H  1.47339 -1.656668 -1.618072
H  0.48741 -2.951907 0.99458
H  1.611356 -5.630242 0.064303
H  3.118372 -4.945971 -0.535641
H  2.397136 -4.334994 0.953771
H  0.47528 -3.513417 -2.839669
H  1.886555 -4.564247 -2.765984
H  0.342756 -5.118606 -2.126106
H  3.644955 -2.405363 0.290246
H  -3.468717 -2.555379 -0.851555
H  -3.730949 -2.435934 0.889156
H  -1.653639 -0.094215 1.308373
H  -4.872777 -0.71197 -1.459274
H  -5.220452 1.722754 -1.580806
H  -3.771053 3.255391 -0.27819
H  -0.32079 4.115601 2.525246
H  -1.016834 2.233869 -1.264384
H  1.603324 5.322853 1.5625
H  0.88775 3.44222 -2.208745
H  2.217562 4.997143 -0.816481
totalener: -1958.42396605 hartree
nucrepener: 2653.66243582 hartree
electener: -4612.08640187 hartree
oneelecener: -7961.00844165 hartree
twoeener: 3348.92203978 hartree
kineticenergy: 1952.63215407 hartree
xcener: -143.517972922448 hartree
chargesum: 0.0000000
charge: -0.019523 -0.047696 -0.277383 -0.372853 -0.294494 0.113856 -0.053066 -0.074138 -0.277592 -0.248688 -0.211373 0.323655 0.071804 0.063270 0.054167 -0.196768 -0.154347 0.191599 -0.110266 -0.151791 0.280161 -0.203067 -0.234546 -0.083661 -0.117081 -0.147868 0.112300 0.089544 0.093740 0.096316 0.082630 0.103774 0.084741 0.086292 0.116102 0.102162 0.109410 0.117741 0.104695 0.126640 0.129495 0.120792 0.133167 0.120940 0.125511 0.121696
qa: -0.0195 -0.0477 -0.2774 -0.3729 -0.2945 0.1139 -0.0531 -0.0741 -0.2776 -0.2487 -0.2114 0.3237 0.0718 0.0633 0.0542 -0.1968 -0.1543 0.1916 -0.1103 -0.1518 0.2802 -0.2031 -0.2345 -0.0837 -0.1171 -0.1479 0.1123 0.0895 0.0937 0.0963 0.0826 0.1038 0.0847 0.0863 0.1161 0.1022 0.1094 0.1177 0.1047 0.1266 0.1295 0.1208 0.1332 0.1209 0.1255 0.1217
va: 1.3338 1.2598 2.1170 2.1249 2.0996 3.7695 3.8860 3.8127 3.9152 3.8937 3.8772 4.2092 4.2185 3.8624 3.6653 4.0444 4.0155 3.8720 3.9446 4.0114 3.7286 4.0365 3.8576 3.9520 3.9424 3.9700 1.0255 1.0300 1.0063 0.9997 1.0020 1.0230 1.0019 1.0023 1.0167 1.0110 0.9862 1.0375 1.0112 1.0001 1.0051 1.0160 1.0159 0.9989 0.9994 1.0006
dispcorr: -0.025863112 hartree
energy: -1958.449829162577
dipole: -11.15994 11.04360 -0.11634 -16.09416 15.17451 -0.91964 -12.44954 12.30620 -0.14334
magnitude: 0.93799 au
magnitude: 2.38418 debye
