program: Orca
programVersion: 5.0.3
elementType: Cl Cl O O O C C C C C C C C C C C C C C C C C C C C C H H H H H H H H H H H H H H H H H H H H
charge: 0
multiplicity: 1
keywords: wb97x-d3
keywords: def2-TZVPP
keywords: def2/J RIJCOSX
keywords: DEFGRID2
keywords: scfconv7
keywords: smallprint printgap noloewdin
keywords: NOSOSCF
formula: C21H20Cl2O3
InChI: InChI=1/C21H20Cl2O3/c1-21(2)17(12-18(22)23)19(21)20(24)25-13-14-7-6-10-16(11-14)26-15-8-4-3-5-9-15/h3-12,17,19H,13H2,1-2H3
46 atoms
Cl 1.525876 0.561534 0.473109
Cl 4.14444 0.029162 1.571293
O  -1.799819 -2.490404 0.392409
O  -1.134948 -2.05156 -1.698312
O  -1.827816 2.471963 1.338006
C  1.382804 -3.715267 -0.849226
C  1.688845 -2.260678 -0.736994
C  0.446238 -2.811903 -0.066971
C  2.172647 -4.694599 -0.013839
C  0.981327 -4.271037 -2.19376
C  2.806314 -1.756021 0.089944
C  -0.880601 -2.407978 -0.580264
C  2.819332 -0.549153 0.641194
C  -3.116586 -2.070651 0.070856
C  -3.252599 -0.577096 -0.048981
C  -2.44411 0.280063 0.687719
C  -4.235405 -0.044444 -0.873067
C  -2.627966 1.649196 0.593193
C  -4.42293 1.327295 -0.946795
C  -3.619203 2.185651 -0.214838
C  -0.788386 3.106782 0.72862
C  -0.047004 3.969933 1.529358
C  -0.443496 2.920709 -0.604748
C  1.033649 4.64533 0.992382
C  0.643313 3.610436 -1.127018
C  1.386306 4.47288 -0.34003
H  1.47607 -1.672111 -1.625679
H  0.494719 -2.925825 1.0098
H  3.112106 -4.954389 -0.506327
H  2.41062 -4.308961 0.977833
H  1.607674 -5.617689 0.123021
H  0.328729 -5.137817 -2.075802
H  0.465147 -3.544664 -2.81547
H  1.871719 -4.600845 -2.731924
H  3.675429 -2.385178 0.240904
H  -3.467117 -2.554873 -0.843831
H  -3.729437 -2.435467 0.89695
H  -1.662339 -0.100726 1.332866
H  -4.856295 -0.703909 -1.466963
H  -5.193287 1.732076 -1.589472
H  -3.750375 3.258313 -0.272953
H  -0.323601 4.100198 2.567361
H  -1.00011 2.243122 -1.23802
H  1.606152 5.313127 1.62259
H  0.909604 3.457331 -2.164528
H  2.23238 5.002877 -0.755423
totalener: -1958.42386414 hartree
nucrepener: 2655.30354995 hartree
electener: -4613.72741409 hartree
oneelecener: -7964.29843382 hartree
twoeener: 3350.57101973 hartree
kineticenergy: 1952.62670718 hartree
xcener: -143.516833212505 hartree
chargesum: 0.0000000
charge: -0.019937 -0.047467 -0.276557 -0.372618 -0.294149 0.114602 -0.049313 -0.080736 -0.276822 -0.249451 -0.217944 0.325048 0.076574 0.063482 0.053633 -0.197913 -0.154163 0.193190 -0.109294 -0.153171 0.275848 -0.201971 -0.232144 -0.084229 -0.114367 -0.149602 0.112493 0.090801 0.095432 0.083739 0.093759 0.086536 0.103690 0.084626 0.116325 0.102158 0.109175 0.117827 0.104708 0.126516 0.129680 0.120961 0.132948 0.121025 0.125391 0.121681
qa: -0.0199 -0.0475 -0.2766 -0.3726 -0.2941 0.1146 -0.0493 -0.0807 -0.2768 -0.2495 -0.2179 0.3250 0.0766 0.0635 0.0536 -0.1979 -0.1542 0.1932 -0.1093 -0.1532 0.2758 -0.2020 -0.2321 -0.0842 -0.1144 -0.1496 0.1125 0.0908 0.0954 0.0837 0.0938 0.0865 0.1037 0.0846 0.1163 0.1022 0.1092 0.1178 0.1047 0.1265 0.1297 0.1210 0.1329 0.1210 0.1254 0.1217
va: 1.3327 1.2601 2.1168 2.1254 2.0988 3.7632 3.8819 3.8163 3.9150 3.8943 3.8845 4.2076 4.2128 3.8624 3.6679 4.0442 4.0160 3.8706 3.9436 4.0118 3.7286 4.0362 3.8618 3.9525 3.9438 3.9726 1.0254 1.0295 0.9999 1.0018 1.0063 1.0022 1.0228 1.0020 1.0163 1.0109 0.9863 1.0381 1.0113 1.0002 1.0050 1.0159 1.0160 0.9989 0.9991 1.0006
dispcorr: -0.025937398 hartree
energy: -1958.449801538749
dipole: -11.01992 10.91640 -0.10352 -16.00985 15.09803 -0.91182 -12.48851 12.33669 -0.15182
magnitude: 0.93015 au
magnitude: 2.36426 debye
