program: Orca
programVersion: 5.0.3
elementType: Cl Cl O O O C C C C C C C C C C C C C C C C C C C C C H H H H H H H H H H H H H H H H H H H H
charge: 0
multiplicity: 1
keywords: wb97x-d3
keywords: def2-TZVPP
keywords: def2/J RIJCOSX
keywords: DEFGRID2
keywords: scfconv7
keywords: smallprint printgap noloewdin
keywords: NOSOSCF
formula: C21H20Cl2O3
InChI: InChI=1/C21H20Cl2O3/c1-21(2)17(12-18(22)23)19(21)20(24)25-13-14-7-6-10-16(11-14)26-15-8-4-3-5-9-15/h3-12,17,19H,13H2,1-2H3
46 atoms
Cl 3.191801 -1.467621 -3.123088
Cl 5.264052 -1.390323 -1.116283
O  -1.34409 -2.205889 1.278843
O  -1.436614 -2.450668 -0.94187
O  -1.055236 2.926811 1.550656
C  1.027343 -4.313201 -0.469923
C  1.507809 -2.961103 -0.912263
C  0.542734 -3.073896 0.251816
C  1.954324 -5.215061 0.311162
C  0.118295 -5.076461 -1.402801
C  2.880084 -2.504998 -0.657055
C  -0.834435 -2.550998 0.092788
C  3.663223 -1.872265 -1.522274
C  -2.651462 -1.631703 1.271588
C  -2.647815 -0.224941 0.744201
C  -1.892405 0.746945 1.38907
C  -3.390881 0.116536 -0.376704
C  -1.872413 2.0464 0.907545
C  -3.377222 1.421851 -0.843547
C  -2.617476 2.393462 -0.214088
C  -1.407439 4.239647 1.664137
C  -2.694651 4.635076 2.007846
C  -0.407467 5.183678 1.480066
C  -2.973747 5.984784 2.154864
C  -0.698411 6.529525 1.640895
C  -1.981727 6.937641 1.971918
H  1.057217 -2.600506 -1.829829
H  0.962359 -2.92432 1.240732
H  2.644943 -5.729036 -0.359409
H  2.54947 -4.683233 1.052738
H  1.380264 -5.9744 0.844203
H  -0.535928 -5.747482 -0.842667
H  -0.507224 -4.429457 -2.011441
H  0.721097 -5.689721 -2.0748
H  3.305453 -2.695794 0.320524
H  -3.343398 -2.255143 0.702012
H  -2.961713 -1.652308 2.316241
H  -1.302856 0.500642 2.264242
H  -3.962899 -0.6407 -0.896094
H  -3.9493 1.68514 -1.723242
H  -2.598133 3.404887 -0.598551
H  -3.472244 3.897774 2.162333
H  0.590551 4.857714 1.21788
H  -3.976616 6.291021 2.421873
H  0.084665 7.262541 1.498018
H  -2.207417 7.988794 2.089369
totalener: -1958.42611847 hartree
nucrepener: 2436.39659857 hartree
electener: -4394.82271704 hartree
oneelecener: -7526.20223640 hartree
twoeener: 3131.37951936 hartree
kineticenergy: 1952.62251710 hartree
xcener: -143.513783257410 hartree
chargesum: -0.0000000
charge: -0.040613 -0.049519 -0.271098 -0.384109 -0.298480 0.072749 0.046344 -0.092236 -0.244449 -0.250903 -0.201309 0.360650 0.048671 0.062263 0.023778 -0.263896 -0.122742 0.243981 -0.110820 -0.168458 0.244320 -0.167836 -0.207588 -0.114998 -0.092013 -0.144162 0.087031 0.074371 0.098788 0.071958 0.092110 0.084026 0.104026 0.087106 0.094994 0.100044 0.113098 0.113152 0.108139 0.125984 0.133074 0.132674 0.125615 0.125985 0.125221 0.125079
qa: -0.0406 -0.0495 -0.2711 -0.3841 -0.2985 0.0727 0.0463 -0.0922 -0.2444 -0.2509 -0.2013 0.3607 0.0487 0.0623 0.0238 -0.2639 -0.1227 0.2440 -0.1108 -0.1685 0.2443 -0.1678 -0.2076 -0.1150 -0.0920 -0.1442 0.0870 0.0744 0.0988 0.0720 0.0921 0.0840 0.1040 0.0871 0.0950 0.1000 0.1131 0.1132 0.1081 0.1260 0.1331 0.1327 0.1256 0.1260 0.1252 0.1251
va: 1.2868 1.2555 2.1265 2.1209 2.1067 3.7476 3.8261 3.8636 3.9103 3.9128 3.9178 4.2273 4.2435 3.8572 3.6806 4.0698 3.9792 3.8399 3.9604 3.9450 3.8090 3.9450 4.0375 3.9449 3.9336 3.9600 1.0484 1.0373 1.0030 1.0101 1.0044 1.0021 1.0241 1.0010 1.0307 1.0100 0.9901 1.0303 1.0178 1.0009 1.0033 1.0038 1.0139 1.0000 0.9989 1.0004
dispcorr: -0.021290974 hartree
energy: -1958.447409444601
dipole: -26.36096 25.74837 -0.61259 -4.41433 4.14360 -0.27073 12.95888 -12.25597 0.70291
magnitude: 0.97089 au
magnitude: 2.46782 debye
