program: Orca
programVersion: 5.0.3
elementType: Cl Cl O O O C C C C C C C C C C C C C C C C C C C C C H H H H H H H H H H H H H H H H H H H H
charge: 0
multiplicity: 1
keywords: wb97x-d3
keywords: def2-TZVPP
keywords: def2/J RIJCOSX
keywords: DEFGRID2
keywords: scfconv7
keywords: smallprint printgap noloewdin
keywords: NOSOSCF
formula: C21H20Cl2O3
InChI: InChI=1/C21H20Cl2O3/c1-21(2)17(12-18(22)23)19(21)20(24)25-13-14-7-6-10-16(11-14)26-15-8-4-3-5-9-15/h3-12,17,19H,13H2,1-2H3
46 atoms
Cl 5.08408 -2.483482 -1.007558
Cl 4.902952 -5.30776 -0.444445
O  -0.804945 -1.405539 1.316974
O  0.639121 -0.094904 0.217588
O  -3.004626 3.70194 -0.485209
C  0.682424 -2.567189 -1.720945
C  1.931706 -2.5502 -0.884892
C  0.578224 -2.449896 -0.214933
C  0.199028 -3.865322 -2.322809
C  0.409659 -1.373569 -2.603616
C  2.73677 -3.75984 -0.67303
C  0.17571 -1.181185 0.435772
C  4.061834 -3.829981 -0.706263
C  -1.397087 -0.264805 1.934222
C  -2.369007 0.419501 1.013946
C  -2.211764 1.761701 0.703877
C  -3.434728 -0.294345 0.472938
C  -3.133346 2.395161 -0.122572
C  -4.334683 0.339802 -0.366317
C  -4.196662 1.687781 -0.661582
C  -2.558588 4.6160 0.42568
C  -1.616767 5.54033 -0.000328
C  -3.062012 4.666584 1.720186
C  -1.180325 6.523355 0.874893
C  -2.609552 5.648027 2.587491
C  -1.668772 6.579428 2.171429
H  2.485069 -1.618791 -0.92014
H  0.219571 -3.340561 0.289201
H  0.315266 -4.719535 -1.656744
H  -0.860833 -3.791696 -2.570844
H  0.74191 -4.087339 -3.24307
H  0.828442 -0.45046 -2.21229
H  0.841149 -1.545463 -3.591106
H  -0.664319 -1.225535 -2.731574
H  2.216743 -4.687349 -0.46761
H  -1.915311 -0.663578 2.807042
H  -0.632636 0.431171 2.284402
H  -1.362582 2.308306 1.095091
H  -3.559768 -1.344169 0.706114
H  -5.163932 -0.213973 -0.786283
H  -4.90236 2.192726 -1.307862
H  -1.234846 5.48587 -1.011241
H  -3.804148 3.949462 2.047121
H  -0.44568 7.243884 0.54045
H  -3.005165 5.688785 3.593949
H  -1.322296 7.34513 2.852096
totalener: -1958.42623110 hartree
nucrepener: 2428.08776271 hartree
electener: -4386.51399381 hartree
oneelecener: -7509.42459749 hartree
twoeener: 3122.91060369 hartree
kineticenergy: 1952.61884077 hartree
xcener: -143.512534099726 hartree
chargesum: 0.0000000
charge: -0.041054 -0.049500 -0.268747 -0.377556 -0.299925 0.066927 0.046998 -0.083615 -0.245592 -0.244805 -0.201449 0.345876 0.046883 0.055756 0.000577 -0.100879 -0.218428 0.203639 -0.080210 -0.208955 0.226213 -0.198911 -0.149730 -0.093910 -0.119014 -0.140953 0.086217 0.074969 0.071187 0.093167 0.098357 0.102985 0.087496 0.087414 0.094601 0.112600 0.102571 0.119126 0.115398 0.125317 0.127125 0.125621 0.129692 0.125153 0.126193 0.125174
qa: -0.0411 -0.0495 -0.2687 -0.3776 -0.2999 0.0669 0.0470 -0.0836 -0.2456 -0.2448 -0.2014 0.3459 0.0469 0.0558 0.0006 -0.1009 -0.2184 0.2036 -0.0802 -0.2090 0.2262 -0.1989 -0.1497 -0.0939 -0.1190 -0.1410 0.0862 0.0750 0.0712 0.0932 0.0984 0.1030 0.0875 0.0874 0.0946 0.1126 0.1026 0.1191 0.1154 0.1253 0.1271 0.1256 0.1297 0.1252 0.1262 0.1252
va: 1.2866 1.2556 2.1269 2.1280 2.1044 3.7653 3.8301 3.8491 3.9066 3.9136 3.9128 4.2596 4.2461 3.8682 3.6934 3.8893 4.0060 3.8508 3.9252 4.0432 3.8309 4.0354 3.9402 3.9355 3.9492 3.9582 1.0493 1.0365 1.0100 1.0042 1.0031 1.0228 1.0010 1.0026 1.0310 0.9894 1.0125 1.0199 1.0163 0.9987 1.0122 1.0135 1.0048 0.9989 1.0000 1.0004
dispcorr: -0.021798831 hartree
energy: -1958.448029926569
dipole: -33.60083 32.52614 -1.07469 17.72942 -17.99788 -0.26846 -1.46788 1.74153 0.27366
magnitude: 1.14102 au
magnitude: 2.90024 debye
