program: Orca
programVersion: 5.0.3
elementType: Cl Cl O O O C C C C C C C C C C C C C C C C C C C C C H H H H H H H H H H H H H H H H H H H H
charge: 0
multiplicity: 1
keywords: wb97x-d3
keywords: def2-TZVPP
keywords: def2/J RIJCOSX
keywords: DEFGRID2
keywords: scfconv7
keywords: smallprint printgap noloewdin
keywords: NOSOSCF
formula: C21H20Cl2O3
InChI: InChI=1/C21H20Cl2O3/c1-21(2)17(12-18(22)23)19(21)20(24)25-13-14-7-6-10-16(11-14)26-15-8-4-3-5-9-15/h3-12,17,19H,13H2,1-2H3
46 atoms
Cl 2.664491 -5.238872 -2.604071
Cl 5.323067 -4.329249 -1.946126
O  0.1703 0.518142 -1.044189
O  -0.783589 -1.411869 -1.658911
O  -2.808419 3.130926 2.578735
C  1.126945 -2.571061 0.534189
C  1.702065 -2.824309 -0.830732
C  1.27681 -1.42427 -0.444396
C  2.042371 -2.544287 1.735261
C  -0.23116 -3.151278 0.846121
C  3.130058 -3.102903 -1.033367
C  0.10742 -0.81293 -1.117112
C  3.629072 -4.093749 -1.762196
C  -0.942123 1.259763 -1.552365
C  -2.0432 1.348464 -0.534204
C  -1.911282 2.228973 0.533553
C  -3.172146 0.543113 -0.627015
C  -2.910201 2.311545 1.493338
C  -4.161066 0.626886 0.341164
C  -4.040085 1.511368 1.400323
C  -2.322394 4.397496 2.432723
C  -1.518577 4.890477 3.450775
C  -2.649441 5.198253 1.344493
C  -1.04131 6.189829 3.378353
C  -2.156494 6.492163 1.28083
C  -1.350903 6.994677 2.292205
H  1.027372 -3.323809 -1.51676
H  2.06999 -0.723487 -0.208138
H  2.993497 -2.050211 1.540443
H  1.564891 -2.013673 2.560191
H  2.260387 -3.558756 2.072786
H  -0.753343 -2.536808 1.581802
H  -0.868308 -3.237511 -0.029629
H  -0.110487 -4.148625 1.272169
H  3.850174 -2.450644 -0.554563
H  -0.538432 2.248347 -1.770129
H  -1.303196 0.825481 -2.485613
H  -1.027894 2.851766 0.614893
H  -3.268977 -0.155324 -1.446918
H  -5.040169 0.00058 0.268486
H  -4.810915 1.585731 2.156065
H  -1.277056 4.25604 4.293359
H  -3.285853 4.819457 0.555085
H  -0.416291 6.570722 4.175217
H  -2.41264 7.113843 0.432983
H  -0.97111 8.005649 2.235632
totalener: -1958.42668342 hartree
nucrepener: 2415.13001443 hartree
electener: -4373.55669785 hartree
oneelecener: -7483.36667274 hartree
twoeener: 3109.80997489 hartree
kineticenergy: 1952.61981660 hartree
xcener: -143.512753373622 hartree
chargesum: 0.0000000
charge: -0.041427 -0.048670 -0.264413 -0.392771 -0.301424 0.069621 0.042561 -0.093255 -0.240574 -0.250423 -0.199457 0.364990 0.045988 0.047670 -0.015171 -0.177813 -0.127924 0.210956 -0.100980 -0.196602 0.242297 -0.210133 -0.158874 -0.091768 -0.118925 -0.146329 0.087901 0.075873 0.070484 0.094144 0.098039 0.088915 0.102003 0.087646 0.097138 0.109674 0.109230 0.119398 0.123141 0.126965 0.127226 0.124887 0.132038 0.125805 0.126937 0.125408
qa: -0.0414 -0.0487 -0.2644 -0.3928 -0.3014 0.0696 0.0426 -0.0933 -0.2406 -0.2504 -0.1995 0.3650 0.0460 0.0477 -0.0152 -0.1778 -0.1279 0.2110 -0.1010 -0.1966 0.2423 -0.2101 -0.1589 -0.0918 -0.1189 -0.1463 0.0879 0.0759 0.0705 0.0941 0.0980 0.0889 0.1020 0.0876 0.0971 0.1097 0.1092 0.1194 0.1231 0.1270 0.1272 0.1249 0.1320 0.1258 0.1269 0.1254
va: 1.2858 1.2567 2.1365 2.1096 2.1049 3.7599 3.8192 3.8779 3.9064 3.9132 3.9085 4.2323 4.2431 3.8677 3.6811 3.9583 3.9513 3.8457 3.9510 4.0317 3.8165 4.0341 3.9297 3.9357 3.9501 3.9616 1.0485 1.0369 1.0097 1.0045 1.0032 1.0017 1.0232 1.0015 1.0288 0.9944 1.0105 1.0152 1.0219 0.9994 1.0115 1.0140 1.0046 0.9985 0.9998 1.0004
dispcorr: -0.021636664 hartree
energy: -1958.448320086411
dipole: -22.60042 22.52174 -0.07868 26.38703 -25.42343 0.96360 20.44029 -19.88375 0.55654
magnitude: 1.11555 au
magnitude: 2.83550 debye
