program: Orca
programVersion: 5.0.3
elementType: Cl Cl O O O C C C C C C C C C C C C C C C C C C C C C H H H H H H H H H H H H H H H H H H H H
charge: 0
multiplicity: 1
keywords: wb97x-d3
keywords: def2-TZVPP
keywords: def2/J RIJCOSX
keywords: DEFGRID2
keywords: scfconv7
keywords: smallprint printgap noloewdin
keywords: NOSOSCF
formula: C21H20Cl2O3
InChI: InChI=1/C21H20Cl2O3/c1-21(2)17(12-18(22)23)19(21)20(24)25-13-14-7-6-10-16(11-14)26-15-8-4-3-5-9-15/h3-12,17,19H,13H2,1-2H3
46 atoms
Cl 4.933772 -1.736736 -0.92847
Cl 5.244238 -4.563689 -0.446939
O  -1.020411 -1.533646 1.314859
O  0.378308 -0.098097 0.320305
O  -2.936426 3.653386 -0.459357
C  0.590497 -2.555396 -1.670717
C  1.848756 -2.351772 -0.874184
C  0.517893 -2.437143 -0.162924
C  0.27581 -3.916226 -2.245784
C  0.123877 -1.421452 -2.550956
C  2.841185 -3.415802 -0.682511
C  -0.015667 -1.21984 0.492349
C  4.158622 -3.250507 -0.686767
C  -1.692188 -0.445716 1.949425
C  -2.573553 0.3079 0.993635
C  -2.323876 1.645404 0.726315
C  -3.637331 -0.335542 0.368955
C  -3.152114 2.346566 -0.141726
C  -4.442038 0.36463 -0.514539
C  -4.211783 1.707881 -0.768696
C  -2.411515 4.494609 0.480564
C  -1.347647 5.301453 0.107791
C  -2.950923 4.5823 1.758387
C  -0.824354 6.205995 1.020129
C  -2.411657 5.481982 2.663491
C  -1.348605 6.297225 2.300393
H  2.253291 -1.347668 -0.926618
H  0.292074 -3.361502 0.357609
H  -0.791123 -3.995637 -2.459599
H  0.815062 -4.073064 -3.181392
H  0.530776 -4.736865 -1.575959
H  0.399147 -0.443299 -2.16446
H  0.564217 -1.523504 -3.544197
H  -0.961597 -1.442121 -2.665239
H  2.485341 -4.424998 -0.514791
H  -2.288553 -0.914552 2.732541
H  -0.974608 0.224332 2.427207
H  -1.471683 2.132278 1.183218
H  -3.835043 -1.380779 0.571267
H  -5.270235 -0.133096 -1.001385
H  -4.843672 2.262749 -1.449528
H  -0.938826 5.218695 -0.890523
H  -3.786635 3.955677 2.04266
H  0.004849 6.836396 0.727491
H  -2.832862 5.550096 3.657871
H  -0.93309 6.99884 3.01088
totalener: -1958.42623402 hartree
nucrepener: 2448.16398284 hartree
electener: -4406.59021686 hartree
oneelecener: -7549.68993355 hartree
twoeener: 3143.09971669 hartree
kineticenergy: 1952.62535770 hartree
xcener: -143.514003796826 hartree
chargesum: 0.0000000
charge: -0.040898 -0.050452 -0.266051 -0.379389 -0.300093 0.065271 0.041846 -0.078709 -0.249614 -0.243057 -0.205747 0.350394 0.052705 0.050453 -0.009620 -0.085474 -0.220414 0.204799 -0.078830 -0.211394 0.225360 -0.191527 -0.153572 -0.097153 -0.118636 -0.138663 0.084226 0.077038 0.092591 0.098824 0.071860 0.101495 0.088363 0.086549 0.095377 0.115051 0.103608 0.116892 0.113543 0.124090 0.125866 0.125534 0.130283 0.125569 0.126308 0.125400
qa: -0.0409 -0.0505 -0.2661 -0.3794 -0.3001 0.0653 0.0418 -0.0787 -0.2496 -0.2431 -0.2057 0.3504 0.0527 0.0505 -0.0096 -0.0855 -0.2204 0.2048 -0.0788 -0.2114 0.2254 -0.1915 -0.1536 -0.0972 -0.1186 -0.1387 0.0842 0.0770 0.0926 0.0988 0.0719 0.1015 0.0884 0.0865 0.0954 0.1151 0.1036 0.1169 0.1135 0.1241 0.1259 0.1255 0.1303 0.1256 0.1263 0.1254
va: 1.2863 1.2545 2.1304 2.1270 2.1068 3.7760 3.8253 3.8329 3.9068 3.9141 3.9264 4.2673 4.2470 3.8685 3.6842 3.8578 4.0065 3.8573 3.9258 4.0417 3.8354 4.0369 3.9501 3.9345 3.9471 3.9569 1.0537 1.0346 1.0043 1.0028 1.0098 1.0215 1.0014 1.0031 1.0311 0.9901 1.0099 1.0248 1.0152 0.9988 1.0124 1.0131 1.0043 0.9990 0.9998 1.0003
dispcorr: -0.022068315 hartree
energy: -1958.448302332892
dipole: -34.19927 33.16280 -1.03647 12.59634 -13.00355 -0.40721 -1.45504 1.71022 0.25518
magnitude: 1.14246 au
magnitude: 2.90390 debye
