program: Orca
programVersion: 5.0.3
elementType: Cl Cl O O O C C C C C C C C C C C C C C C C C C C C C H H H H H H H H H H H H H H H H H H H H
charge: 0
multiplicity: 1
keywords: wb97x-d3
keywords: def2-TZVPP
keywords: def2/J RIJCOSX
keywords: DEFGRID2
keywords: scfconv7
keywords: smallprint printgap noloewdin
keywords: NOSOSCF
formula: C21H20Cl2O3
InChI: InChI=1/C21H20Cl2O3/c1-21(2)17(12-18(22)23)19(21)20(24)25-13-14-7-6-10-16(11-14)26-15-8-4-3-5-9-15/h3-12,17,19H,13H2,1-2H3
46 atoms
Cl 3.985205 -4.518355 0.675425
Cl 4.101791 -5.782541 -1.916496
O  -1.574688 -1.575155 -0.643633
O  -0.121605 -1.466269 1.060174
O  -1.291807 3.350082 1.467184
C  1.894028 -1.125246 -1.308471
C  2.002911 -2.501573 -0.715218
C  0.650488 -1.975212 -1.141658
C  2.34843 -0.883587 -2.728494
C  2.150888 0.0566 -0.404471
C  2.603966 -3.618583 -1.454439
C  -0.356723 -1.650868 -0.105298
C  3.447933 -4.513568 -0.955808
C  -2.651392 -1.126569 0.186674
C  -2.806526 0.364492 0.084274
C  -2.021912 1.209956 0.860946
C  -3.719339 0.907942 -0.812537
C  -2.137452 2.58594 0.722269
C  -3.837948 2.28323 -0.934005
C  -3.048167 3.131684 -0.17544
C  -1.680873 4.598597 1.861962
C  -2.855197 4.794455 2.577605
C  -0.843255 5.664829 1.574627
C  -3.185681 6.070609 3.00369
C  -1.181861 6.936607 2.013402
C  -2.353575 7.145874 2.72399
H  2.155852 -2.517768 0.357688
H  0.235945 -2.36746 -2.063803
H  1.900626 0.033063 -3.114815
H  3.432757 -0.767918 -2.769589
H  2.075689 -1.687003 -3.411819
H  1.574995 0.92503 -0.730012
H  1.90222 -0.139447 0.634861
H  3.207941 0.3240 -0.448297
H  2.347144 -3.736378 -2.499978
H  -3.537772 -1.62939 -0.199186
H  -2.499629 -1.444143 1.218707
H  -1.312063 0.805529 1.570748
H  -4.336723 0.255913 -1.417622
H  -4.548009 2.704876 -1.632904
H  -3.140231 4.204172 -0.286245
H  -3.500984 3.955568 2.804091
H  0.068564 5.492603 1.017981
H  -4.098093 6.222899 3.564947
H  -0.525657 7.767856 1.791933
H  -2.61579 8.139154 3.062119
totalener: -1958.42652211 hartree
nucrepener: 2416.74958687 hartree
electener: -4375.17610899 hartree
oneelecener: -7486.72031916 hartree
twoeener: 3111.54421017 hartree
kineticenergy: 1952.61898239 hartree
xcener: -143.512706225846 hartree
chargesum: 0.0000000
charge: -0.041001 -0.050235 -0.260353 -0.393320 -0.296301 0.072429 0.046721 -0.081390 -0.246135 -0.256609 -0.204730 0.356292 0.050402 0.044671 0.013436 -0.197217 -0.177592 0.206438 -0.115528 -0.151717 0.205010 -0.139443 -0.185266 -0.122257 -0.105491 -0.130719 0.086059 0.075061 0.093575 0.098422 0.070658 0.089620 0.102493 0.089438 0.095188 0.097696 0.119020 0.139864 0.106789 0.126425 0.131422 0.133203 0.125666 0.127372 0.125899 0.126033
qa: -0.0410 -0.0502 -0.2604 -0.3933 -0.2963 0.0724 0.0467 -0.0814 -0.2461 -0.2566 -0.2047 0.3563 0.0504 0.0447 0.0134 -0.1972 -0.1776 0.2064 -0.1155 -0.1517 0.2050 -0.1394 -0.1853 -0.1223 -0.1055 -0.1307 0.0861 0.0751 0.0936 0.0984 0.0707 0.0896 0.1025 0.0894 0.0952 0.0977 0.1190 0.1399 0.1068 0.1264 0.1314 0.1332 0.1257 0.1274 0.1259 0.1260
va: 1.2865 1.2548 2.1384 2.1056 2.0998 3.7557 3.8196 3.8677 3.9067 3.9149 3.9168 4.2498 4.2445 3.8503 3.7212 3.9638 4.0256 3.8670 3.9708 3.9360 3.8452 3.9511 4.0271 3.9451 3.9400 3.9478 1.0505 1.0360 1.0042 1.0026 1.0103 1.0017 1.0217 1.0021 1.0307 0.9987 1.0118 1.0313 1.0120 1.0010 1.0053 1.0032 1.0126 1.0000 0.9993 1.0000
dispcorr: -0.021765764 hartree
energy: -1958.448287879100
dipole: -22.09561 21.14648 -0.94913 38.43933 -37.34049 1.09884 -2.43472 1.64743 -0.78729
magnitude: 1.65170 au
magnitude: 4.19830 debye
