program: Orca
programVersion: 5.0.3
elementType: Cl Cl O O O C C C C C C C C C C C C C C C C C C C C C H H H H H H H H H H H H H H H H H H H H
charge: 0
multiplicity: 1
keywords: wb97x-d3
keywords: def2-TZVPP
keywords: def2/J RIJCOSX
keywords: DEFGRID2
keywords: scfconv7
keywords: smallprint printgap noloewdin
keywords: NOSOSCF
formula: C21H20Cl2O3
InChI: InChI=1/C21H20Cl2O3/c1-21(2)17(12-18(22)23)19(21)20(24)25-13-14-7-6-10-16(11-14)26-15-8-4-3-5-9-15/h3-12,17,19H,13H2,1-2H3
46 atoms
Cl 2.760135 -4.815424 -2.553135
Cl 5.329813 -3.520039 -2.354759
O  -0.47438 0.313549 -1.358486
O  -1.071188 -1.841357 -1.223303
O  -3.498765 3.61105 1.71446
C  1.383386 -1.993203 0.70676
C  1.769234 -2.510469 -0.648174
C  1.108082 -1.151428 -0.521086
C  2.445039 -1.468833 1.645076
C  0.261083 -2.695664 1.431677
C  3.165185 -2.588012 -1.093494
C  -0.258994 -0.96882 -1.062046
C  3.672695 -3.519394 -1.891935
C  -1.777852 0.680267 -1.821616
C  -2.704133 0.937189 -0.667699
C  -2.647417 2.162321 -0.013437
C  -3.597937 -0.035243 -0.234098
C  -3.473328 2.407943 1.074665
C  -4.426922 0.223818 0.846451
C  -4.365343 1.438311 1.510033
C  -2.343371 4.27874 1.991714
C  -2.400911 5.665448 1.963868
C  -1.16603 3.631443 2.347638
C  -1.277334 6.405418 2.294832
C  -0.04728 4.385714 2.66678
C  -0.093717 5.771478 2.642639
H  1.115252 -3.283038 -1.035675
H  1.752391 -0.287246 -0.637232
H  3.210986 -0.876893 1.145244
H  1.990895 -0.82972 2.403575
H  2.943416 -2.291893 2.159617
H  0.672889 -3.495309 2.049602
H  -0.266025 -2.004674 2.092047
H  -0.469249 -3.136153 0.758814
H  3.853096 -1.822983 -0.755347
H  -1.620761 1.590772 -2.399417
H  -2.178892 -0.08305 -2.489496
H  -1.961007 2.927356 -0.357539
H  -3.637849 -0.992107 -0.736159
H  -5.125053 -0.531231 1.182574
H  -5.008377 1.645652 2.35519
H  -3.326571 6.153509 1.688745
H  -1.11938 2.550776 2.381373
H  -1.328941 7.485874 2.274237
H  0.867448 3.87957 2.945583
H  0.782754 6.351604 2.896677
totalener: -1958.42677859 hartree
nucrepener: 2444.22731655 hartree
electener: -4402.65409514 hartree
oneelecener: -7541.40607056 hartree
twoeener: 3138.75197542 hartree
kineticenergy: 1952.62370551 hartree
xcener: -143.514094506760 hartree
chargesum: -0.0000000
charge: -0.040546 -0.049121 -0.261754 -0.394906 -0.299013 0.068543 0.037935 -0.084000 -0.253132 -0.248867 -0.201156 0.367687 0.051544 0.046038 -0.009006 -0.192360 -0.135438 0.228218 -0.098150 -0.201711 0.259355 -0.222013 -0.170609 -0.085575 -0.112380 -0.151980 0.085623 0.078106 0.073727 0.092079 0.099378 0.088314 0.086166 0.103572 0.094759 0.106050 0.112243 0.121492 0.126462 0.126765 0.126737 0.125391 0.130417 0.125679 0.124454 0.124982
qa: -0.0405 -0.0491 -0.2618 -0.3949 -0.2990 0.0685 0.0379 -0.0840 -0.2531 -0.2489 -0.2012 0.3677 0.0515 0.0460 -0.0090 -0.1924 -0.1354 0.2282 -0.0981 -0.2017 0.2594 -0.2220 -0.1706 -0.0856 -0.1124 -0.1520 0.0856 0.0781 0.0737 0.0921 0.0994 0.0883 0.0862 0.1036 0.0948 0.1061 0.1122 0.1215 0.1265 0.1268 0.1267 0.1254 0.1304 0.1257 0.1245 0.1250
va: 1.2870 1.2557 2.1395 2.1064 2.1089 3.7601 3.8310 3.8548 3.9097 3.9128 3.9249 4.2300 4.2511 3.8657 3.6855 3.9771 3.9550 3.8469 3.9480 4.0357 3.8097 4.0396 3.9347 3.9318 3.9463 3.9700 1.0509 1.0348 1.0099 1.0042 1.0023 1.0010 1.0026 1.0234 1.0323 0.9972 1.0098 1.0127 1.0221 0.9994 1.0119 1.0146 1.0054 0.9986 1.0002 1.0007
dispcorr: -0.021714693 hartree
energy: -1958.448493281297
dipole: -19.06105 19.17589 0.11484 23.21300 -22.40206 0.81094 23.86872 -23.24114 0.62757
magnitude: 1.03182 au
magnitude: 2.62269 debye
