program: Orca
programVersion: 5.0.3
elementType: Cl Cl O O O C C C C C C C C C C C C C C C C C C C C C H H H H H H H H H H H H H H H H H H H H
charge: 0
multiplicity: 1
keywords: wb97x-d3
keywords: def2-TZVPP
keywords: def2/J RIJCOSX
keywords: DEFGRID2
keywords: scfconv7
keywords: smallprint printgap noloewdin
keywords: NOSOSCF
formula: C21H20Cl2O3
InChI: InChI=1/C21H20Cl2O3/c1-21(2)17(12-18(22)23)19(21)20(24)25-13-14-7-6-10-16(11-14)26-15-8-4-3-5-9-15/h3-12,17,19H,13H2,1-2H3
46 atoms
Cl 0.759269 -0.071712 -1.045115
Cl 3.594335 0.318366 -0.633938
O  -1.728198 -2.504341 0.937467
O  -1.61827 -3.279442 -1.162213
O  -1.587068 2.687672 1.537545
C  1.209449 -4.368241 -0.283001
C  1.318251 -3.037265 -0.942852
C  0.343007 -3.2259 0.205621
C  2.298637 -4.798237 0.67059
C  0.608496 -5.512465 -1.061388
C  2.457689 -2.111961 -0.76769
C  -1.090999 -3.040666 -0.107674
C  2.297666 -0.794925 -0.809462
C  -2.979434 -1.85865 0.684891
C  -2.718181 -0.470967 0.171683
C  -2.279939 0.505802 1.057232
C  -2.816849 -0.175593 -1.182402
C  -1.954994 1.773434 0.599112
C  -2.488036 1.093964 -1.633718
C  -2.056734 2.074816 -0.754617
C  -0.73258 3.70192 1.206807
C  0.498638 3.451864 0.613564
C  -1.108638 4.994864 1.535818
C  1.347512 4.513333 0.343554
C  -0.244244 6.046672 1.27063
C  0.98222 5.81234 0.668263
H  0.827686 -2.968014 -1.91023
H  0.64599 -2.797039 1.153618
H  2.694694 -3.968828 1.257402
H  1.921075 -5.543522 1.371851
H  3.130605 -5.249528 0.12621
H  0.144671 -6.234829 -0.387623
H  -0.146614 -5.18672 -1.772003
H  1.391297 -6.033443 -1.615492
H  3.457437 -2.502132 -0.619059
H  -3.590184 -2.436909 -0.009191
H  -3.485967 -1.833279 1.649282
H  -2.183232 0.287406 2.114077
H  -3.132039 -0.938526 -1.881221
H  -2.566774 1.327273 -2.687237
H  -1.808407 3.06214 -1.121303
H  0.795165 2.440175 0.368734
H  -2.06947 5.16859 2.002217
H  2.306512 4.317854 -0.117872
H  -0.53815 7.055111 1.530179
H  1.652165 6.63497 0.457982
totalener: -1958.42318304 hartree
nucrepener: 2645.85240197 hartree
electener: -4604.27558501 hartree
oneelecener: -7945.20812063 hartree
twoeener: 3340.93253562 hartree
kineticenergy: 1952.63466982 hartree
xcener: -143.517375631017 hartree
chargesum: 0.0000000
charge: -0.032891 -0.049158 -0.260747 -0.388538 -0.297822 0.134192 -0.045515 -0.097855 -0.272733 -0.247996 -0.237229 0.334145 0.104038 0.055613 -0.016954 -0.210509 -0.118868 0.230372 -0.137955 -0.156348 0.200729 -0.111775 -0.181813 -0.140001 -0.108949 -0.124021 0.112643 0.093620 0.082189 0.093913 0.094901 0.086469 0.101712 0.082798 0.119293 0.107804 0.105729 0.108056 0.121158 0.126108 0.128730 0.113735 0.124613 0.125646 0.124371 0.125101
qa: -0.0329 -0.0492 -0.2607 -0.3885 -0.2978 0.1342 -0.0455 -0.0979 -0.2727 -0.2480 -0.2372 0.3341 0.1040 0.0556 -0.0170 -0.2105 -0.1189 0.2304 -0.1380 -0.1563 0.2007 -0.1118 -0.1818 -0.1400 -0.1089 -0.1240 0.1126 0.0936 0.0822 0.0939 0.0949 0.0865 0.1017 0.0828 0.1193 0.1078 0.1057 0.1081 0.1212 0.1261 0.1287 0.1137 0.1246 0.1256 0.1244 0.1251
va: 1.3340 1.2601 2.1186 2.1053 2.1032 3.7293 3.8630 3.8339 3.9126 3.8920 3.9162 4.2258 4.1856 3.8589 3.7080 4.0634 3.9227 3.8372 3.9462 3.8929 3.8362 3.9155 4.0166 3.9759 3.9388 3.9394 1.0304 1.0296 1.0016 1.0070 1.0000 1.0025 1.0228 1.0020 1.0153 1.0134 0.9958 1.0264 1.0212 1.0030 1.0084 1.0390 1.0130 1.0020 0.9995 1.0000
dispcorr: -0.026488893 hartree
energy: -1958.449671937987
dipole: -6.00190 6.45345 0.45155 -14.76751 14.50602 -0.26149 3.04511 -2.87852 0.16659
magnitude: 0.54775 au
magnitude: 1.39227 debye
