program: Orca
programVersion: 5.0.3
elementType: Cl Cl O O O C C C C C C C C C C C C C C C C C C C C C H H H H H H H H H H H H H H H H H H H H
charge: 0
multiplicity: 1
keywords: wb97x-d3
keywords: def2-TZVPP
keywords: def2/J RIJCOSX
keywords: DEFGRID2
keywords: scfconv7
keywords: smallprint printgap noloewdin
keywords: NOSOSCF
formula: C21H20Cl2O3
InChI: InChI=1/C21H20Cl2O3/c1-21(2)17(12-18(22)23)19(21)20(24)25-13-14-7-6-10-16(11-14)26-15-8-4-3-5-9-15/h3-12,17,19H,13H2,1-2H3
46 atoms
Cl 2.424655 -5.218381 -0.774332
Cl 5.017886 -4.1981 -1.517527
O  -0.604755 0.387751 -1.996745
O  -1.178058 -1.669147 -1.324173
O  -2.327033 2.585262 2.267888
C  1.374431 -1.068929 0.47208
C  1.619435 -2.187176 -0.50583
C  1.057218 -0.876777 -0.996937
C  2.534386 -0.268477 1.013756
C  0.261224 -1.247206 1.476939
C  2.97397 -2.585771 -0.907587
C  -0.351874 -0.808035 -1.447862
C  3.40311 -3.834116 -1.047409
C  -1.971422 0.691183 -2.252047
C  -2.734034 0.929057 -0.977003
C  -2.163639 1.690033 0.037794
C  -4.004153 0.396947 -0.807051
C  -2.867723 1.91046 1.21318
C  -4.70443 0.633928 0.365969
C  -4.144056 1.390806 1.380656
C  -1.558438 3.691557 2.052837
C  -0.422962 3.841635 2.836044
C  -1.913941 4.670874 1.132872
C  0.355793 4.981035 2.701519
C  -1.120848 5.799843 1.002059
C  0.015105 5.961929 1.782398
H  0.894657 -2.9916 -0.45689
H  1.731956 -0.212854 -1.526839
H  3.004426 -0.789144 1.849656
H  3.306294 -0.072533 0.270485
H  2.18402 0.698819 1.377598
H  -0.16265 -0.282317 1.763091
H  -0.550352 -1.869135 1.107538
H  0.655491 -1.717776 2.379031
H  3.697292 -1.806387 -1.113691
H  -1.943527 1.596837 -2.859563
H  -2.445887 -0.095932 -2.841875
H  -1.166905 2.098008 -0.081224
H  -4.439512 -0.219139 -1.583202
H  -5.693106 0.214941 0.497721
H  -4.679166 1.571813 2.303382
H  -0.163478 3.072073 3.551374
H  -2.805123 4.557553 0.529039
H  1.237918 5.097634 3.317259
H  -1.401118 6.562927 0.287828
H  0.626723 6.847631 1.6777
totalener: -1958.42552113 hartree
nucrepener: 2501.04816430 hartree
electener: -4459.47368544 hartree
oneelecener: -7655.15706793 hartree
twoeener: 3195.68338250 hartree
kineticenergy: 1952.61856106 hartree
xcener: -143.513643461516 hartree
chargesum: -0.0000000
charge: -0.040745 -0.050328 -0.271329 -0.358942 -0.305128 0.067189 0.043782 -0.061206 -0.244081 -0.242597 -0.204822 0.304992 0.050592 0.068099 0.063922 -0.252930 -0.162662 0.254851 -0.081542 -0.219508 0.248281 -0.221934 -0.157955 -0.088872 -0.114808 -0.146290 0.083753 0.076608 0.097734 0.071716 0.091066 0.079462 0.103870 0.092818 0.094850 0.107185 0.103549 0.127606 0.106290 0.125552 0.126652 0.125551 0.130856 0.126101 0.126904 0.125854
qa: -0.0407 -0.0503 -0.2713 -0.3589 -0.3051 0.0672 0.0438 -0.0612 -0.2441 -0.2426 -0.2048 0.3050 0.0506 0.0681 0.0639 -0.2529 -0.1627 0.2549 -0.0815 -0.2195 0.2483 -0.2219 -0.1580 -0.0889 -0.1148 -0.1463 0.0838 0.0766 0.0977 0.0717 0.0911 0.0795 0.1039 0.0928 0.0949 0.1072 0.1035 0.1276 0.1063 0.1256 0.1267 0.1256 0.1309 0.1261 0.1269 0.1259
va: 1.2869 1.2546 2.1139 2.1445 2.0848 3.7741 3.8416 3.8143 3.9034 3.9075 3.9238 4.3162 4.2451 3.8624 3.6728 3.9126 4.0249 3.7560 3.9410 4.0565 3.8075 4.0256 3.9421 3.9322 3.9479 3.9645 1.0522 1.0348 1.0030 1.0104 1.0056 1.0059 1.0205 1.0027 1.0309 0.9890 1.0101 1.0221 1.0127 0.9990 1.0123 1.0142 1.0056 0.9985 0.9998 1.0003
dispcorr: -0.023524137 hartree
energy: -1958.449045271893
dipole: -18.37846 18.28737 -0.09110 33.77932 -32.38326 1.39605 12.25148 -12.24237 0.00911
magnitude: 1.39905 au
magnitude: 3.55611 debye
