program: Orca
programVersion: 5.0.3
elementType: Cl Cl O O O C C C C C C C C C C C C C C C C C C C C C H H H H H H H H H H H H H H H H H H H H
charge: 0
multiplicity: 1
keywords: wb97x-d3
keywords: def2-TZVPP
keywords: def2/J RIJCOSX
keywords: DEFGRID2
keywords: scfconv7
keywords: smallprint printgap noloewdin
keywords: NOSOSCF
formula: C21H20Cl2O3
InChI: InChI=1/C21H20Cl2O3/c1-21(2)17(12-18(22)23)19(21)20(24)25-13-14-7-6-10-16(11-14)26-15-8-4-3-5-9-15/h3-12,17,19H,13H2,1-2H3
46 atoms
Cl 1.697901 0.61419 -2.183167
Cl 4.060143 1.152758 -0.619433
O  -1.436401 -2.299645 -0.610587
O  -1.786095 -2.177672 1.595209
O  -1.713022 2.677193 -0.295264
C  1.38419 -3.281806 0.240196
C  1.375974 -1.895184 -0.334081
C  0.445763 -2.244279 0.81452
C  2.51241 -3.714901 1.14672
C  0.864505 -4.409679 -0.618739
C  2.47725 -0.944473 -0.131845
C  -1.030201 -2.245435 0.666529
C  2.703092 0.130796 -0.876327
C  -2.815388 -2.067911 -0.859889
C  -3.209414 -0.641692 -0.580244
C  -2.266491 0.373946 -0.623517
C  -4.531556 -0.335723 -0.280028
C  -2.635295 1.672559 -0.303088
C  -4.900556 0.973616 -0.019263
C  -3.952163 1.985317 -0.009307
C  -0.572127 2.535307 0.440454
C  -0.474586 1.696944 1.545034
C  0.509702 3.317277 0.05649
C  0.717521 1.64783 2.254126
C  1.68829 3.261343 0.77974
C  1.802467 2.423624 1.88009
H  0.884373 -1.812671 -1.29547
H  0.73152 -1.872416 1.79188
H  2.200261 -4.564455 1.755632
H  3.380995 -4.025126 0.563283
H  2.832863 -2.932766 1.834066
H  1.688925 -4.854657 -1.178201
H  0.423858 -5.194535 -0.001192
H  0.116048 -4.088923 -1.338442
H  3.175497 -1.12455 0.675456
H  -2.949124 -2.306708 -1.916207
H  -3.438421 -2.752184 -0.279025
H  -1.23337 0.168262 -0.876468
H  -5.272839 -1.124043 -0.23278
H  -5.930994 1.205935 0.214238
H  -4.222984 3.004268 0.232791
H  -1.309627 1.084705 1.859126
H  0.419197 3.962528 -0.807191
H  0.786848 0.996402 3.115773
H  2.528128 3.869025 0.471363
H  2.72814 2.377299 2.437067
totalener: -1958.42149259 hartree
nucrepener: 2735.70945669 hartree
electener: -4694.13094928 hartree
oneelecener: -8124.76087708 hartree
twoeener: 3430.62992780 hartree
kineticenergy: 1952.63088239 hartree
xcener: -143.522250606895 hartree
chargesum: 0.0000000
charge: -0.052224 -0.057827 -0.286873 -0.337526 -0.298646 0.072814 0.068271 -0.044901 -0.275239 -0.248254 -0.221336 0.288552 0.084310 0.036173 0.084073 -0.193938 -0.191520 0.242332 -0.087197 -0.201251 0.295086 -0.161321 -0.241746 -0.151700 -0.097866 -0.140818 0.087231 0.082316 0.096938 0.101748 0.075008 0.089124 0.094040 0.090397 0.096413 0.105779 0.108964 0.100170 0.105283 0.123890 0.124276 0.141739 0.119020 0.127086 0.126888 0.122263
qa: -0.0522 -0.0578 -0.2869 -0.3375 -0.2986 0.0728 0.0683 -0.0449 -0.2752 -0.2483 -0.2213 0.2886 0.0843 0.0362 0.0841 -0.1939 -0.1915 0.2423 -0.0872 -0.2013 0.2951 -0.1613 -0.2417 -0.1517 -0.0979 -0.1408 0.0872 0.0823 0.0969 0.1017 0.0750 0.0891 0.0940 0.0904 0.0964 0.1058 0.1090 0.1002 0.1053 0.1239 0.1243 0.1417 0.1190 0.1271 0.1269 0.1223
va: 1.2736 1.2440 2.0846 2.1627 2.1174 3.8473 3.7154 3.7775 3.9218 3.9042 3.9206 4.2765 4.1972 3.8596 3.6400 3.9782 4.0305 3.8059 3.9421 4.0549 3.7330 3.8604 3.9944 3.9128 3.8561 3.8832 1.0447 1.0293 1.0036 1.0005 1.0085 1.0023 1.0017 1.0186 1.0359 0.9893 1.0058 1.0250 1.0104 0.9994 1.0118 1.0083 1.0174 1.0003 1.0024 1.0033
dispcorr: -0.029942116 hartree
energy: -1958.451434704649
dipole: -10.26284 10.43754 0.17469 -20.83949 19.81709 -1.02240 11.14372 -11.33177 -0.18805
magnitude: 1.05413 au
magnitude: 2.67938 debye
