program: Orca
programVersion: 5.0.2
elementType: Cl Cl O O O C C C C C C C C C C C C C C C C C C C C C H H H H H H H H H H H H H H H H H H H H
charge: 0
multiplicity: 1
keywords: wb97x-d3
keywords: def2-TZVPP
keywords: def2/J RIJCOSX
keywords: DEFGRID2
keywords: scfconv7
keywords: smallprint printgap noloewdin
keywords: NOSOSCF
formula: C21H20Cl2O3
InChI: InChI=1/C21H20Cl2O3/c1-21(2)17(12-18(22)23)19(21)20(24)25-13-14-7-6-10-16(11-14)26-15-8-4-3-5-9-15/h3-12,17,19H,13H2,1-2H3
46 atoms
Cl -1.203588 0.899136 2.350633
Cl -2.620865 -1.149994 0.883911
O  1.036638 3.115678 -0.419094
O  -0.402989 1.712262 -1.38703
O  2.487934 -2.477846 -1.201428
C  -2.542622 3.857462 -0.703609
C  -2.512503 2.898659 0.435077
C  -1.210838 3.52888 -0.05103
C  -3.066649 5.244286 -0.413179
C  -2.868487 3.392379 -2.100737
C  -2.776779 1.4554 0.258496
C  -0.19319 2.681694 -0.698894
C  -2.276024 0.527228 1.060259
C  2.132373 2.356076 -0.939754
C  2.267856 1.020945 -0.263746
C  2.285535 -0.144196 -1.019635
C  2.367821 0.941398 1.12159
C  2.423266 -1.374757 -0.395844
C  2.496968 -0.295242 1.735412
C  2.532296 -1.461721 0.985889
C  1.806406 -3.613072 -0.8597
C  2.416237 -4.825761 -1.149654
C  0.535121 -3.575362 -0.298503
C  1.746708 -6.009343 -0.874361
C  -0.117497 -4.767334 -0.019312
C  0.481915 -5.987435 -0.302827
H  -2.831717 3.291071 1.396748
H  -0.803579 4.301064 0.590786
H  -4.152811 5.271632 -0.520684
H  -2.825447 5.57179 0.598932
H  -2.645819 5.973014 -1.108352
H  -3.948679 3.434319 -2.253749
H  -2.408619 4.054237 -2.836693
H  -2.545034 2.379434 -2.322152
H  -3.429924 1.131304 -0.543154
H  2.042409 2.242662 -2.021963
H  3.007116 2.976107 -0.743542
H  2.188398 -0.098559 -2.098024
H  2.347549 1.840646 1.72472
H  2.579087 -0.35625 2.812867
H  2.644942 -2.420636 1.475916
H  3.405452 -4.840341 -1.589963
H  0.050318 -2.631238 -0.083188
H  2.224237 -6.953723 -1.102159
H  -1.107202 -4.736752 0.418193
H  -0.033767 -6.912992 -0.083262
elementType: Cl O C H
totalener: -1958.44585134 hartree
nucrepener: 2638.21688966 hartree
electener: -4596.66274100 hartree
oneelecener: -7931.64507451 hartree
twoeener: 3334.98233351 hartree
cpcmener: -0.02523637 hartree
kineticenergy: 1952.58229895 hartree
xcener: -143.510894973336 hartree
chargesum: -0.0000000
charge: -0.056669 -0.064381 -0.288335 -0.456272 -0.331750 0.105647 -0.052819 -0.091527 -0.258095 -0.288089 -0.165078 0.382592 0.064369 0.099624 0.050647 -0.229189 -0.266195 0.249176 -0.128829 -0.183986 0.258048 -0.235728 -0.154822 -0.131556 -0.150215 -0.177517 0.121493 0.094188 0.095571 0.088364 0.096904 0.100014 0.101157 0.096901 0.139556 0.114201 0.124461 0.129249 0.137667 0.157338 0.156455 0.144795 0.133535 0.157367 0.154196 0.157538
qa: -0.0567 -0.0644 -0.2883 -0.4563 -0.3318 0.1056 -0.0528 -0.0915 -0.2581 -0.2881 -0.1651 0.3826 0.0644 0.0996 0.0506 -0.2292 -0.2662 0.2492 -0.1288 -0.1840 0.2580 -0.2357 -0.1548 -0.1316 -0.1502 -0.1775 0.1215 0.0942 0.0956 0.0884 0.0969 0.1000 0.1012 0.0969 0.1396 0.1142 0.1245 0.1292 0.1377 0.1573 0.1565 0.1448 0.1335 0.1574 0.1542 0.1575
va: 1.2730 1.2437 2.1225 2.0298 2.0695 3.7650 3.8712 3.8655 3.9017 3.8947 3.8515 4.0968 4.1630 3.7949 3.5801 4.0431 3.9300 3.7565 3.8659 3.9178 3.7459 3.9904 3.8807 3.8942 3.8923 3.9020 1.0066 1.0319 1.0022 1.0044 1.0023 0.9987 1.0002 1.0167 1.0052 1.0088 0.9915 1.0211 1.0130 0.9902 0.9951 1.0083 1.0165 0.9892 0.9917 0.9903
dispcorr: -0.025913978 hartree
energy: -1958.471765316615
dipole: 0.17682 -0.62757 -0.45075 13.36217 -11.82687 1.53531 -12.33621 12.74336 0.40714
magnitude: 1.65109 au
magnitude: 4.19674 debye
