program: Orca
programVersion: 5.0.2
elementType: Cl Cl O O O C C C C C C C C C C C C C C C C C C C C C H H H H H H H H H H H H H H H H H H H H
charge: 0
multiplicity: 1
keywords: wb97x-d3
keywords: def2-TZVPP
keywords: def2/J RIJCOSX
keywords: DEFGRID2
keywords: scfconv7
keywords: smallprint printgap noloewdin
keywords: NOSOSCF
formula: C21H20Cl2O3
InChI: InChI=1/C21H20Cl2O3/c1-21(2)17(12-18(22)23)19(21)20(24)25-13-14-7-6-10-16(11-14)26-15-8-4-3-5-9-15/h3-12,17,19H,13H2,1-2H3
46 atoms
Cl -1.873177 -0.633458 0.497616
Cl -1.065428 -0.706984 -2.280002
O  0.35403 2.783834 -0.123029
O  0.414304 3.164443 2.081447
O  1.667928 -2.000709 1.33739
C  -2.519752 3.82306 -0.016068
C  -2.533699 2.331762 -0.00009
C  -1.682155 3.089211 1.015517
C  -3.741568 4.513815 0.542871
C  -1.88895 4.587779 -1.15225
C  -1.948061 1.525278 -1.08869
C  -0.207707 3.024508 1.053498
C  -1.669867 0.235209 -0.970997
C  1.769541 2.585525 -0.221793
C  2.072637 1.13005 -0.437217
C  1.699957 0.186138 0.51511
C  2.726911 0.714268 -1.58988
C  1.994703 -1.153777 0.318215
C  3.024519 -0.629697 -1.773809
C  2.66667 -1.573497 -0.825129
C  1.230573 -3.274276 1.109739
C  1.590832 -4.228361 2.052689
C  0.407176 -3.613537 0.042678
C  1.117278 -5.526199 1.930902
C  -0.049701 -4.919078 -0.07189
C  0.298848 -5.880091 0.867141
H  -3.405839 1.874844 0.4585
H  -2.090426 3.107156 2.019007
H  -4.178898 3.959505 1.373953
H  -3.494995 5.514156 0.9027
H  -4.508193 4.615509 -0.227773
H  -2.635204 4.763944 -1.929076
H  -1.543931 5.562629 -0.804614
H  -1.044917 4.089664 -1.620566
H  -1.768937 1.987007 -2.052426
H  2.099556 3.174624 -1.076821
H  2.276077 2.96785 0.664774
H  1.200021 0.482736 1.429508
H  3.010442 1.438501 -2.343507
H  3.545938 -0.947893 -2.667203
H  2.917306 -2.615815 -0.975478
H  2.229736 -3.950341 2.881624
H  0.110966 -2.874691 -0.689875
H  1.396533 -6.26384 2.672187
H  -0.692965 -5.179982 -0.902447
H  -0.067199 -6.894022 0.772826
elementType: Cl O C H
totalener: -1958.44254616 hartree
nucrepener: 2697.36727796 hartree
electener: -4655.80982412 hartree
oneelecener: -8049.06031496 hartree
twoeener: 3393.25049083 hartree
cpcmener: -0.02536467 hartree
kineticenergy: 1952.57477365 hartree
xcener: -143.512806244216 hartree
chargesum: 0.0000000
charge: -0.057266 -0.061302 -0.262215 -0.468103 -0.320968 0.106392 -0.051791 -0.128492 -0.259493 -0.279401 -0.148743 0.426080 0.057266 0.047306 0.036618 -0.243366 -0.220471 0.269406 -0.128421 -0.200124 0.338878 -0.251695 -0.206474 -0.123533 -0.171258 -0.181897 0.116109 0.095696 0.088306 0.097029 0.095286 0.100579 0.103270 0.091178 0.137186 0.109465 0.124417 0.135029 0.141814 0.158857 0.153485 0.144122 0.121252 0.156755 0.156193 0.157040
qa: -0.0573 -0.0613 -0.2622 -0.4681 -0.3210 0.1064 -0.0518 -0.1285 -0.2595 -0.2794 -0.1487 0.4261 0.0573 0.0473 0.0366 -0.2434 -0.2205 0.2694 -0.1284 -0.2001 0.3389 -0.2517 -0.2065 -0.1235 -0.1713 -0.1819 0.1161 0.0957 0.0883 0.0970 0.0953 0.1006 0.1033 0.0912 0.1372 0.1095 0.1244 0.1350 0.1418 0.1589 0.1535 0.1441 0.1213 0.1568 0.1562 0.1570
va: 1.2717 1.2473 2.1115 2.0372 2.0793 3.7831 3.8244 3.8892 3.9015 3.8998 3.8626 4.1298 4.1806 3.8171 3.6619 3.9248 3.9715 3.7627 3.8954 3.9097 3.5920 4.0034 3.8796 3.8853 3.9574 3.9030 1.0091 1.0285 1.0053 1.0019 1.0020 0.9988 1.0002 1.0121 1.0096 1.0027 1.0182 1.0402 1.0026 0.9896 0.9968 1.0095 1.0368 0.9893 0.9909 0.9904
dispcorr: -0.028399723 hartree
energy: -1958.470945882832
dipole: -1.44803 0.76318 -0.68485 16.00440 -15.34563 0.65877 0.33234 -1.97636 -1.64402
magnitude: 1.89890 au
magnitude: 4.82661 debye
