program: Orca
programVersion: 5.0.2
elementType: Cl Cl O O O C C C C C C C C C C C C C C C C C C C C C H H H H H H H H H H H H H H H H H H H H
charge: 0
multiplicity: 1
keywords: wb97x-d3
keywords: def2-TZVPP
keywords: def2/J RIJCOSX
keywords: DEFGRID2
keywords: scfconv7
keywords: smallprint printgap noloewdin
keywords: NOSOSCF
formula: C21H20Cl2O3
InChI: InChI=1/C21H20Cl2O3/c1-21(2)17(12-18(22)23)19(21)20(24)25-13-14-7-6-10-16(11-14)26-15-8-4-3-5-9-15/h3-12,17,19H,13H2,1-2H3
46 atoms
Cl -0.211448 1.055958 2.26823
Cl -1.838612 -1.277475 1.766633
O  0.831245 2.725235 -0.95868
O  -0.75244 1.236124 -1.476549
O  1.591087 -2.60518 0.640504
C  -2.797444 3.340068 -0.505659
C  -2.346817 2.628966 0.723282
C  -1.311091 3.209082 -0.239729
C  -3.346581 4.735699 -0.319292
C  -3.47523 2.593172 -1.627329
C  -2.499296 1.167269 0.882898
C  -0.424293 2.278856 -0.962988
C  -1.637352 0.418079 1.555203
C  1.857121 1.853639 -1.460701
C  2.256015 0.852014 -0.414608
C  1.739165 -0.438926 -0.43598
C  3.112097 1.238028 0.611541
C  2.092838 -1.339027 0.561122
C  3.453406 0.333237 1.605013
C  2.953072 -0.958384 1.582595
C  1.159232 -3.282065 -0.465656
C  -0.006572 -4.023172 -0.330367
C  1.876863 -3.304646 -1.656007
C  -0.45725 -4.791345 -1.394064
C  1.405798 -4.065206 -2.71666
C  0.240369 -4.810112 -2.593621
H  -2.41496 3.186091 1.653817
H  -0.817816 4.107548 0.111467
H  -4.416422 4.700454 -0.104837
H  -2.861091 5.261172 0.504158
H  -3.207704 5.331884 -1.223001
H  -4.551377 2.56693 -1.444513
H  -3.318587 3.109416 -2.576179
H  -3.137941 1.568357 -1.751321
H  -3.36546 0.678159 0.452541
H  1.5413 1.3718 -2.386644
H  2.689195 2.516531 -1.693836
H  1.060982 -0.730147 -1.226823
H  3.517383 2.242458 0.630543
H  4.124265 0.629677 2.400997
H  3.221497 -1.668848 2.354492
H  -0.549015 -4.007982 0.606219
H  2.795898 -2.741833 -1.760754
H  -1.365114 -5.370193 -1.283012
H  1.963448 -4.079404 -3.644263
H  -0.118096 -5.403358 -3.424534
elementType: Cl O C H
totalener: -1958.44405057 hartree
nucrepener: 2716.56056459 hartree
electener: -4675.00461516 hartree
oneelecener: -8088.70632782 hartree
twoeener: 3413.70171266 hartree
cpcmener: -0.02425032 hartree
kineticenergy: 1952.58846266 hartree
xcener: -143.513776237529 hartree
chargesum: -0.0000000
charge: -0.054383 -0.063579 -0.280370 -0.458241 -0.317118 0.112978 -0.045686 -0.099653 -0.260692 -0.290226 -0.174620 0.378066 0.076773 0.081317 -0.012815 -0.181609 -0.239520 0.293506 -0.103305 -0.271353 0.321728 -0.259744 -0.221191 -0.122947 -0.133846 -0.190119 0.119804 0.093995 0.095185 0.087824 0.096718 0.098806 0.100124 0.098268 0.137945 0.115285 0.123589 0.136339 0.140120 0.156480 0.143096 0.145307 0.154877 0.156850 0.158315 0.157719
qa: -0.0544 -0.0636 -0.2804 -0.4582 -0.3171 0.1130 -0.0457 -0.0997 -0.2607 -0.2902 -0.1746 0.3781 0.0768 0.0813 -0.0128 -0.1816 -0.2395 0.2935 -0.1033 -0.2714 0.3217 -0.2597 -0.2212 -0.1229 -0.1338 -0.1901 0.1198 0.0940 0.0952 0.0878 0.0967 0.0988 0.1001 0.0983 0.1379 0.1153 0.1236 0.1363 0.1401 0.1565 0.1431 0.1453 0.1549 0.1568 0.1583 0.1577
va: 1.2869 1.2485 2.1203 2.0223 2.0769 3.7429 3.8682 3.8642 3.9034 3.8885 3.8696 4.1158 4.1636 3.8145 3.6349 3.8234 3.9748 3.6905 3.8700 4.0285 3.6529 4.0161 3.9297 3.9072 3.8805 3.9171 1.0063 1.0332 1.0023 1.0041 1.0022 0.9985 1.0005 1.0167 1.0072 1.0117 0.9937 1.0306 1.0038 0.9880 1.0086 1.0079 0.9989 0.9904 0.9900 0.9906
dispcorr: -0.027728704 hartree
energy: -1958.471779276088
dipole: -5.48994 5.26000 -0.22994 12.81457 -11.33662 1.47795 -18.77005 18.29977 -0.47028
magnitude: 1.56792 au
magnitude: 3.98533 debye
