program: Orca
programVersion: 5.0.2
elementType: Cl Cl O O O C C C C C C C C C C C C C C C C C C C C C H H H H H H H H H H H H H H H H H H H H
charge: 0
multiplicity: 1
keywords: wb97x-d3
keywords: def2-TZVPP
keywords: def2/J RIJCOSX
keywords: DEFGRID2
keywords: scfconv7
keywords: smallprint printgap noloewdin
keywords: NOSOSCF
formula: C21H20Cl2O3
InChI: InChI=1/C21H20Cl2O3/c1-21(2)17(12-18(22)23)19(21)20(24)25-13-14-7-6-10-16(11-14)26-15-8-4-3-5-9-15/h3-12,17,19H,13H2,1-2H3
46 atoms
Cl -0.872552 4.876201 0.51459
Cl 0.822017 3.403219 2.336293
O  -0.482419 1.018942 -1.059178
O  -1.366688 1.673867 -2.997159
O  1.941108 -3.35213 0.972767
C  -3.322833 1.083638 0.040733
C  -2.623862 2.34203 0.433533
C  -2.653675 1.922695 -1.033862
C  -4.833461 1.125362 0.021081
C  -2.789777 -0.268472 0.446306
C  -1.381885 2.342018 1.232291
C  -1.452966 1.528981 -1.798492
C  -0.591172 3.398728 1.34937
C  0.718695 0.580459 -1.70988
C  1.551079 -0.081926 -0.655016
C  1.359188 -1.432714 -0.38096
C  2.46719 0.654553 0.086075
C  2.101372 -2.044617 0.620476
C  3.194375 0.035549 1.09297
C  3.022116 -1.312659 1.360499
C  1.535185 -4.285939 0.057878
C  0.548944 -5.176216 0.45653
C  2.127843 -4.396736 -1.194462
C  0.1548 -6.189597 -0.405979
C  1.714851 -5.406507 -2.051211
C  0.730388 -6.306339 -1.663202
H  -3.268113 3.194718 0.627717
H  -3.336166 2.493555 -1.652642
H  -5.234813 0.889186 1.008533
H  -5.213309 2.106914 -0.264687
H  -5.233908 0.394681 -0.684207
H  -3.109951 -1.029772 -0.267441
H  -1.707732 -0.32806 0.522634
H  -3.200978 -0.541838 1.420107
H  -1.105896 1.451686 1.784546
H  0.476359 -0.115631 -2.514936
H  1.238817 1.437946 -2.141399
H  0.62889 -1.993522 -0.952805
H  2.613211 1.706903 -0.122954
H  3.911217 0.604232 1.670879
H  3.59573 -1.799185 2.139611
H  0.099018 -5.079767 1.43688
H  2.907002 -3.709998 -1.501729
H  -0.611356 -6.886649 -0.091495
H  2.176249 -5.493799 -3.026553
H  0.417469 -7.094621 -2.335218
elementType: Cl O C H
totalener: -1958.44472270 hartree
nucrepener: 2573.45740822 hartree
electener: -4531.90213092 hartree
oneelecener: -7800.33566483 hartree
twoeener: 3268.43353392 hartree
cpcmener: -0.02601544 hartree
kineticenergy: 1952.56906144 hartree
xcener: -143.506288276479 hartree
chargesum: -0.0000000
charge: -0.056544 -0.061494 -0.253536 -0.470875 -0.326667 0.105512 -0.052267 -0.116990 -0.261042 -0.269979 -0.133431 0.416497 0.020827 0.064929 -0.015020 -0.203328 -0.226677 0.290579 -0.109206 -0.245401 0.286674 -0.245474 -0.198881 -0.122227 -0.140083 -0.183234 0.118087 0.094851 0.095173 0.088623 0.097670 0.103360 0.079311 0.101598 0.135928 0.114443 0.118937 0.141176 0.137821 0.157100 0.146284 0.145954 0.156264 0.157283 0.159448 0.158029
qa: -0.0565 -0.0615 -0.2535 -0.4709 -0.3267 0.1055 -0.0523 -0.1170 -0.2610 -0.2700 -0.1334 0.4165 0.0208 0.0649 -0.0150 -0.2033 -0.2267 0.2906 -0.1092 -0.2454 0.2867 -0.2455 -0.1989 -0.1222 -0.1401 -0.1832 0.1181 0.0949 0.0952 0.0886 0.0977 0.1034 0.0793 0.1016 0.1359 0.1144 0.1189 0.1412 0.1378 0.1571 0.1463 0.1460 0.1563 0.1573 0.1594 0.1580
va: 1.2705 1.2436 2.1036 2.0364 2.0807 3.7855 3.8309 3.9068 3.9055 3.9070 3.8008 4.1111 4.2118 3.8253 3.7442 3.8712 3.9202 3.7228 3.8911 4.0082 3.6851 4.0118 3.9251 3.8821 3.8867 3.9046 1.0095 1.0285 1.0021 1.0051 1.0016 1.0008 1.0072 1.0002 1.0084 1.0018 0.9995 1.0090 1.0112 0.9887 1.0068 1.0078 0.9971 0.9894 0.9899 0.9906
dispcorr: -0.024920277 hartree
energy: -1958.469642975443
dipole: -13.21338 12.59976 -0.61362 -29.69745 28.55683 -1.14062 -8.60913 9.20187 0.59274
magnitude: 1.42439 au
magnitude: 3.62051 debye
