program: Orca
programVersion: 5.0.2
elementType: Cl Cl O O O C C C C C C C C C C C C C C C C C C C C C H H H H H H H H H H H H H H H H H H H H
charge: 0
multiplicity: 1
keywords: wb97x-d3
keywords: def2-TZVPP
keywords: def2/J RIJCOSX
keywords: DEFGRID2
keywords: scfconv7
keywords: smallprint printgap noloewdin
keywords: NOSOSCF
formula: C21H20Cl2O3
InChI: InChI=1/C21H20Cl2O3/c1-21(2)17(12-18(22)23)19(21)20(24)25-13-14-7-6-10-16(11-14)26-15-8-4-3-5-9-15/h3-12,17,19H,13H2,1-2H3
46 atoms
Cl -4.123661 3.607862 -0.117226
Cl -3.160663 3.30357 2.584798
O  0.43205 1.345569 0.167738
O  1.014664 1.779944 -1.938127
O  3.45827 -2.747634 -0.38697
C  -1.859896 -0.312923 -0.995988
C  -2.413524 1.052866 -0.726741
C  -1.132229 0.894376 -1.548816
C  -2.582289 -1.138129 -2.035578
C  -1.289858 -1.16336 0.112243
C  -2.42859 1.639994 0.619755
C  0.202633 1.375481 -1.140572
C  -3.144244 2.701512 0.970402
C  1.714174 1.765269 0.628588
C  2.821606 0.811402 0.270502
C  2.573501 -0.549655 0.117447
C  4.115501 1.298588 0.140841
C  3.621693 -1.41108 -0.177562
C  5.156895 0.424328 -0.139723
C  4.920883 -0.929596 -0.302256
C  2.257214 -3.353277 -0.112739
C  1.834292 -3.52366 1.198719
C  1.510431 -3.845542 -1.171909
C  0.647561 -4.198827 1.444885
C  0.329662 -4.529205 -0.912237
C  -0.10615 -4.705027 0.393391
H  -3.254801 1.340238 -1.347406
H  -1.278933 1.056995 -2.610124
H  -2.986916 -0.522525 -2.839877
H  -1.907021 -1.870099 -2.483137
H  -3.412465 -1.683839 -1.582984
H  -2.086459 -1.772787 0.543327
H  -0.539463 -1.845808 -0.289123
H  -0.830739 -0.609305 0.92552
H  -1.853377 1.171526 1.406651
H  1.94157 2.771061 0.268965
H  1.604989 1.823003 1.712301
H  1.56622 -0.931458 0.217398
H  4.310837 2.358265 0.250776
H  6.165539 0.803316 -0.242721
H  5.730779 -1.610223 -0.532919
H  2.428396 -3.139743 2.019088
H  1.854579 -3.703199 -2.188775
H  0.315398 -4.335158 2.465986
H  -0.252772 -4.918738 -1.737268
H  -1.028718 -5.234565 0.592288
elementType: Cl O C H
totalener: -1958.44436016 hartree
nucrepener: 2598.09635124 hartree
electener: -4556.54071140 hartree
oneelecener: -7849.43700909 hartree
twoeener: 3292.89629768 hartree
cpcmener: -0.02718145 hartree
kineticenergy: 1952.56904367 hartree
xcener: -143.512593504225 hartree
chargesum: -0.0000000
charge: -0.055516 -0.059877 -0.281172 -0.453052 -0.325762 0.139838 0.008766 -0.085895 -0.266203 -0.289947 -0.184994 0.396536 0.021708 0.066993 0.003023 -0.190883 -0.239526 0.303887 -0.103470 -0.266674 0.227856 -0.159727 -0.156809 -0.160753 -0.166357 -0.151151 0.095373 0.096918 0.091561 0.094313 0.095745 0.117355 0.046304 0.103709 0.123329 0.120300 0.116822 0.118496 0.139609 0.155691 0.142986 0.154069 0.146543 0.157416 0.155161 0.157461
qa: -0.0555 -0.0599 -0.2812 -0.4531 -0.3258 0.1398 0.0088 -0.0859 -0.2662 -0.2899 -0.1850 0.3965 0.0217 0.0670 0.0030 -0.1909 -0.2395 0.3039 -0.1035 -0.2667 0.2279 -0.1597 -0.1568 -0.1608 -0.1664 -0.1512 0.0954 0.0969 0.0916 0.0943 0.0957 0.1174 0.0463 0.1037 0.1233 0.1203 0.1168 0.1185 0.1396 0.1557 0.1430 0.1541 0.1465 0.1574 0.1552 0.1575
va: 1.2728 1.2476 2.1029 2.0508 2.0891 3.7262 3.8458 3.8499 3.9098 3.8947 3.8325 4.1493 4.2286 3.8118 3.7039 3.8754 3.9802 3.7178 3.8978 3.9961 3.7375 3.9086 3.9264 3.8651 3.8654 3.8266 1.0236 1.0272 1.0062 1.0021 1.0016 1.0015 1.0173 1.0108 1.0263 1.0082 0.9935 1.0218 1.0018 0.9888 1.0102 0.9973 1.0036 0.9911 0.9926 0.9911
dispcorr: -0.026588199 hartree
energy: -1958.470948363092
dipole: 14.78404 -15.44843 -0.66439 -29.55610 28.29539 -1.26072 -8.74840 9.50687 0.75847
magnitude: 1.61434 au
magnitude: 4.10333 debye
